program: Orca
programVersion: 5.0.2
elementType: Cl Cl S S P O O C C C C C C C C C C C H H H H H H H H H H H H H H H
charge: 0
multiplicity: 1
keywords: wb97x-d3
keywords: def2-TZVPP
keywords: def2/J RIJCOSX
keywords: DEFGRID2
keywords: scfconv7
keywords: smallprint printgap noloewdin
keywords: NOSOSCF
formula: C11H15Cl2O2PS2
InChI: InChI=1/C11H15Cl2O2PS2/c1-3-7-18-16(17,14-4-2)15-11-6-5-9(12)8-10(11)13/h5-6,8H,3-4,7H2,1-2H3
33 atoms
Cl -0.779088 1.272107 -2.399925
Cl -5.377326 1.110194 0.359073
S  3.015553 -0.88591 -0.542592
S  1.306588 -0.330061 2.368298
P  1.405462 -0.067559 0.465857
O  0.151831 -0.675627 -0.392759
O  1.391195 1.434618 -0.060413
C  3.353731 -2.391896 0.438516
C  2.360155 -3.520232 0.236652
C  2.269203 -4.017295 -1.195641
C  -1.12745 -0.235261 -0.184418
C  1.919403 2.549618 0.682696
C  -1.692103 0.680962 -1.066448
C  -1.884934 -0.734659 0.862444
C  3.424947 2.623694 0.619309
C  -3.003858 1.097089 -0.903861
C  -3.196471 -0.325875 1.037592
C  -3.740846 0.592208 0.154612
H  3.4264 -2.09656 1.486162
H  4.354169 -2.687717 0.114439
H  2.681647 -4.337106 0.888814
H  1.37494 -3.216278 0.598509
H  3.241232 -4.358075 -1.560424
H  1.575972 -4.856231 -1.270709
H  1.913504 -3.238604 -1.873267
H  1.466554 3.425629 0.221192
H  1.570397 2.497135 1.715851
H  -1.451515 -1.46193 1.535499
H  3.751228 3.543979 1.105392
H  3.900664 1.791213 1.138418
H  3.784539 2.644905 -0.409683
H  -3.438649 1.805638 -1.595709
H  -3.781293 -0.723622 1.855548
elementType: Cl S P O C H
totalener: -2637.01074736 hartree
nucrepener: 2136.81796558 hartree
electener: -4773.82871295 hartree
oneelecener: -7885.97014853 hartree
twoeener: 3112.14143558 hartree
cpcmener: -0.01373416 hartree
kineticenergy: 2631.01722486 hartree
xcener: -154.151556845602 hartree
chargesum: 0.0000000
charge: -0.065083 -0.082832 -0.148561 -0.420400 0.629371 -0.347096 -0.343057 -0.111029 -0.089386 -0.256330 0.266588 0.036395 -0.017532 -0.190828 -0.242989 -0.089111 -0.124248 0.051963 0.126349 0.129446 0.081740 0.055615 0.085170 0.092968 0.074002 0.103232 0.095013 0.150922 0.100697 0.080213 0.091211 0.129042 0.148546
qa: -0.0651 -0.0828 -0.1486 -0.4204 0.6294 -0.3471 -0.3431 -0.1110 -0.0894 -0.2563 0.2666 0.0364 -0.0175 -0.1908 -0.2430 -0.0891 -0.1242 0.0520 0.1263 0.1294 0.0817 0.0556 0.0852 0.0930 0.0740 0.1032 0.0950 0.1509 0.1007 0.0802 0.0912 0.1290 0.1485
va: 1.2437 1.2180 2.3073 2.0326 5.3878 2.0938 2.1358 3.8675 3.8737 3.9384 3.7834 3.8668 4.0206 4.0170 3.9011 3.9994 3.9885 3.8892 1.0302 1.0031 1.0083 1.0225 1.0009 1.0049 1.0140 0.9917 1.0130 1.0040 1.0110 1.0148 1.0041 1.0160 1.0017
dispcorr: -0.017804792 hartree
energy: -2637.028552155630
dipole: 29.85147 -28.99904 0.85243 -13.66020 13.43791 -0.22229 5.80182 -5.58470 0.21712
magnitude: 0.90729 au
magnitude: 2.30616 debye
