program: Orca
programVersion: 5.0.2
elementType: Cl Cl S S P O O C C C C C C C C C C C H H H H H H H H H H H H H H H
charge: 0
multiplicity: 1
keywords: wb97x-d3
keywords: def2-TZVPP
keywords: def2/J RIJCOSX
keywords: DEFGRID2
keywords: scfconv7
keywords: smallprint printgap noloewdin
keywords: NOSOSCF
formula: C11H15Cl2O2PS2
InChI: InChI=1/C11H15Cl2O2PS2/c1-3-7-18-16(17,14-4-2)15-11-6-5-9(12)8-10(11)13/h5-6,8H,3-4,7H2,1-2H3
33 atoms
Cl -1.075897 3.07246 -0.409271
Cl -5.388189 -0.007249 0.485747
S  2.013575 -1.644282 -1.283016
S  1.272163 -0.294448 1.793963
P  1.553293 -0.021596 -0.086357
O  0.265222 0.559121 -0.91029
O  2.660736 1.040982 -0.506415
C  3.131281 -2.605822 -0.191695
C  2.408334 -3.717541 0.543872
C  3.375573 -4.533011 1.388744
C  -1.033489 0.383656 -0.540098
C  2.796855 2.319252 0.159387
C  -1.80411 1.516045 -0.301249
C  -1.611588 -0.871242 -0.437734
C  4.247076 2.532557 0.504514
C  -3.149408 1.404907 0.009032
C  -2.952179 -0.99874 -0.115856
C  -3.709224 0.141327 0.100853
H  3.636711 -1.924516 0.493615
H  3.894259 -3.004633 -0.862074
H  1.629117 -3.286656 1.175321
H  1.908795 -4.366434 -0.179273
H  2.855572 -5.341613 1.903428
H  4.15964 -4.983038 0.776833
H  3.8599 -3.916922 2.148353
H  2.432235 3.080834 -0.53007
H  2.178211 2.350674 1.05851
H  -1.021301 -1.759253 -0.624631
H  4.365997 3.513859 0.964981
H  4.60129 1.784055 1.214033
H  4.881156 2.501626 -0.382156
H  -3.74399 2.291857 0.180461
H  -3.395227 -1.982018 -0.039716
elementType: Cl S P O C H
totalener: -2637.01142637 hartree
nucrepener: 2097.19658647 hartree
electener: -4734.20801283 hartree
oneelecener: -7806.49208535 hartree
twoeener: 3072.28407251 hartree
cpcmener: -0.01456456 hartree
kineticenergy: 2631.01036888 hartree
xcener: -154.147886287902 hartree
chargesum: -0.0000000
charge: -0.064298 -0.083253 -0.146496 -0.418232 0.617271 -0.346186 -0.331683 -0.082376 -0.094491 -0.262718 0.216580 0.038051 0.019241 -0.139670 -0.232666 -0.103231 -0.142841 0.063492 0.108150 0.127506 0.062714 0.068917 0.092828 0.083107 0.084348 0.104182 0.086942 0.134386 0.090370 0.083256 0.089693 0.130415 0.146694
qa: -0.0643 -0.0833 -0.1465 -0.4182 0.6173 -0.3462 -0.3317 -0.0824 -0.0945 -0.2627 0.2166 0.0381 0.0192 -0.1397 -0.2327 -0.1032 -0.1428 0.0635 0.1081 0.1275 0.0627 0.0689 0.0928 0.0831 0.0843 0.1042 0.0869 0.1344 0.0904 0.0833 0.0897 0.1304 0.1467
va: 1.2464 1.2173 2.3003 2.0157 5.3990 2.1161 2.1155 3.8479 3.8922 3.9504 3.7809 3.8353 3.9880 3.9747 3.9621 4.0116 4.0315 3.8771 1.0261 1.0084 1.0267 1.0128 1.0042 1.0016 1.0021 0.9981 1.0144 1.0163 1.0075 1.0086 1.0038 1.0157 1.0025
dispcorr: -0.017133538 hartree
energy: -2637.028559906315
dipole: 36.75781 -35.62038 1.13743 -18.22101 17.68593 -0.53509 6.34390 -6.59488 -0.25098
magnitude: 1.28182 au
magnitude: 3.25813 debye
