program: Gaussian 09
title: 000066485
version: EM64L-G09RevD.01
frameworkgroup: C1[X(C14H10O6)]
method: RPBEPBE
basis: SDD
operation: Freq
keyword: #pfreq=noraman
keyword: PBEPBE/SDD
title: #p freq=noraman PBEPBE/SDD
converged: YES YES NO NO
title: Mulliken charges:
elementType: O O O O O O C C C C C C C C C C C C C C H H H H H H H H H H
charge: -0.360135 -0.545364 -0.173908 -0.345489 -0.550807 -0.400225 0.154973 0.112108 -0.522766 -0.501538 0.132174 0.139793 -0.105739 0.033265 0.037572 0.166112 0.235016 0.083438 -0.379465 -0.354058 0.238572 0.256608 0.256119 0.257199 0.228242 0.265320 0.415148 0.411986 0.392660 0.423191
chargesum: 0.00000
title: Mulliken charges with hydrogens summed into heavy atoms:
elementType: O O O O O O C C C C C C C C C C C C C C
charge: 0.055013 -0.133378 -0.173908 -0.345489 -0.158147 0.022966 0.154973 0.112108 -0.027587 0.011780 0.132174 0.139793 -0.105739 0.033265 0.037572 0.166112 0.235016 0.083438 -0.151223 -0.088738
polarizability: 3.14328329e+02 3.20889344e+00 2.04983412e+02 1.54132138e+00 -1.66782893e+00 7.52580837e+01
1716.lowfreq: -7.5186 -3.5721 -0.0010 -0.0009 -0.0006 7.2841 47.9286 63.5600 88.2550
frequency: 47.9144 63.5552 88.2541 126.6452 146.4902 154.4354 173.6559 201.9617 248.2135 265.0984 267.1116 309.3871 350.0998 356.3691 381.9157 389.2896 415.4548 424.7871 433.7820 448.9834 458.9044 489.2672 496.2276 519.4496 539.5496 555.4966 587.8229 598.1203 646.7959 684.9646 702.9570 714.1068 732.5022 741.7709 770.0125 794.9513 805.9770 830.9147 868.0901 871.0923 919.4963 923.3864 937.6802 951.9496 1006.4357 1021.4521 1107.9474 1119.3496 1142.5475 1153.3338 1182.9356 1199.5330 1222.2323 1237.8931 1253.2184 1275.6311 1291.1917 1293.1209 1323.7094 1351.2981 1376.4586 1387.6636 1405.5919 1435.4743 1441.0517 1448.4490 1451.7330 1479.1435 1529.6773 1550.2957 1567.3052 1587.2627 1621.3249 1639.6584 1893.8482 2976.9686 2987.6413 2997.7567 3067.6203 3089.3227 3126.3644 3185.6793 3222.3328 3624.8484
redmass: 8.1445 5.1900 7.8417 6.0943 6.3429 3.0238 4.8672 5.6107 1.4626 3.5029 3.1297 7.0000 3.8330 6.0326 6.5126 6.3905 5.3131 7.8600 4.3306 8.2450 6.1663 5.6397 6.5086 4.7503 6.0415 3.8674 3.9063 4.2625 4.9036 5.3175 5.5866 2.6112 1.7582 5.7941 3.9485 4.3126 1.5001 2.5413 5.4722 1.0839 1.3640 9.0572 4.5397 4.0525 2.1157 2.4563 2.1550 2.6347 1.2544 1.4659 2.0282 1.0665 2.2321 2.1158 2.9538 3.6601 1.4699 3.7547 1.6501 2.5139 4.7618 4.6064 5.7397 2.0858 1.3181 2.0645 1.2625 3.6499 3.9581 3.7652 5.1219 7.8936 4.3197 4.6091 1.0785 1.0678 1.0645 1.0675 1.0936 1.0961 1.0907 1.0947 1.0670 1.0668
irintensity: 4.9047 3.4588 0.2887 0.2367 0.6647 5.1280 0.5841 0.2569 115.2525 28.5788 29.9665 3.7902 1.0066 0.2338 19.4828 1.1218 12.3611 2.5813 5.8977 1.1733 4.4102 2.1869 3.8883 7.2687 20.6865 16.2466 1.0478 2.6260 5.4916 8.4015 5.1601 44.5145 79.3513 11.3119 2.6555 5.9196 104.0759 10.3963 12.9167 104.5777 0.5368 135.2719 4.3983 13.6208 1.6927 68.3027 112.5636 14.1080 4.0225 36.0278 158.2181 141.5117 35.3066 75.4834 140.2729 32.2898 4.1829 2.3416 42.1097 89.6156 224.0289 264.2521 230.6409 18.1813 19.9905 208.9043 23.1882 32.1761 18.9492 417.4657 143.9254 316.4483 70.0778 9.5286 265.5936 4.7184 17.4153 189.3376 15.0209 17.5715 12.2743 2.4534 323.7667 83.8489
temp: 298.150 k
press: 1.00000 atm
elementType: 8 8 8 8 8 8 6 6 6 6 6 6 6 6 6 6 6 6 6 6 1 1 1 1 1 1 1 1 1 1
symmnumber: 1
zpe: 554530.1 jmol-1
zpe.correction: 0.211209 hartree
zpe.thermalcorrener: 0.227187 hartree
zpe.thermalcorrenthalpy: 0.228131 hartree
zpe.thermalcorrgfe: 0.168572 hartree
zpe.sumelectzpe: -989.459095 hartree
zpe.sumelectthermal: -989.443117 hartree
zpe.sumelectthermalent: -989.442173 hartree
zpe.sumelectthermalfe: -989.501732 hartree
dipole: 3.8189 0.8871 0.5186
dipole: 3.9547
quadrupole: -90.2835 -130.4434 -115.1317
quadrupole: 23.9542 -1.7151 1.6057
quadrupole: 21.6693 -18.4905 -3.1788 23.9542 -1.7151 1.6057
hfenergy: -989.670304 hartree
pointgroup: C01 [X(C14H10O6)]
dipole: -1.4938337 -0.3663116 0.2347299 debye
polarizability: 314.0987653|4.6680849|205.1112414|-5.6338575|-0.4269797|75.3598175 unknown
InChI: InChI=1S/C14H10O6/c15-5-1-2-7(17)11-9(5)13(18)10-6(16)3-4-8-12(10)14(11)20-21-19-8/h1-2,15,17-18H,3-4H2
charge 0 multiplicity 1
30 atoms
O  -0.016159 -2.856847 0.000052
O  0.003554 2.75658 -0.063197
O  2.704185 -2.730342 -0.263593
O  2.387472 2.750727 -0.188865
O  -2.559827 -2.805978 0.059255
O  -2.529235 2.823056 0.005006
C  1.222749 -0.797445 -0.047948
C  1.21754 0.661137 -0.058384
C  3.739422 -0.636503 0.408743
C  3.763751 0.739423 -0.292588
C  -1.277301 -0.742485 0.001426
C  -1.272162 0.701344 -0.002368
C  -0.011584 -1.480524 -0.025879
C  -0.01059 1.382708 -0.035888
C  2.538334 -1.503085 -0.010594
C  2.434797 1.434521 -0.16809
C  -2.552129 -1.383958 0.040515
C  -2.508782 1.445004 0.016935
C  -3.752422 -0.654722 0.063755
C  -3.737088 0.757005 0.050521
H  3.683649 -0.48606 1.506171
H  4.657763 -1.20795 0.196962
H  3.977758 0.605771 -1.373588
H  4.553969 1.397392 0.108239
H  -4.713986 -1.182232 0.093006
H  -4.664131 1.334843 0.067051
H  -0.96371 -3.199732 0.03436
H  1.124728 3.036073 -0.120813
H  -3.469466 -3.185511 0.059714
H  -1.563697 3.157487 -0.024418
