program: Orca
programVersion: 5.0.2
elementType: Cl Cl S S P O O C C C C C C C C C C C H H H H H H H H H H H H H H H
charge: 0
multiplicity: 1
keywords: wb97x-d3
keywords: def2-TZVPP
keywords: def2/J RIJCOSX
keywords: DEFGRID2
keywords: scfconv7
keywords: smallprint printgap noloewdin
keywords: NOSOSCF
formula: C11H15Cl2O2PS2
InChI: InChI=1/C11H15Cl2O2PS2/c1-3-7-18-16(17,14-4-2)15-11-6-5-9(12)8-10(11)13/h5-6,8H,3-4,7H2,1-2H3
33 atoms
Cl -1.103081 3.007283 -0.6817
Cl -5.314955 -0.077993 0.599931
S  2.120996 -1.670919 -1.096684
S  1.311887 -0.039413 1.82164
P  1.599085 0.047512 -0.075635
O  0.296079 0.490737 -0.962056
O  2.671052 1.103047 -0.596109
C  3.297138 -2.450424 0.081086
C  2.64303 -3.479244 0.983314
C  2.070155 -4.672257 0.237608
C  -0.993979 0.320639 -0.559077
C  2.809228 2.411999 0.009982
C  -1.789994 1.45114 -0.413005
C  -1.537055 -0.932901 -0.328817
C  4.178897 2.537673 0.624822
C  -3.126048 1.336717 -0.06519
C  -2.86763 -1.062622 0.031812
C  -3.650065 0.074132 0.158497
H  3.791029 -1.66523 0.652886
H  4.058259 -2.907235 -0.553371
H  3.411932 -3.819887 1.682959
H  1.870368 -2.997791 1.585634
H  1.265893 -4.380454 -0.440193
H  2.835757 -5.178612 -0.353567
H  1.655484 -5.401775 0.934181
H  2.657527 3.13651 -0.790216
H  2.032803 2.574535 0.760557
H  -0.926596 -1.819652 -0.444286
H  4.300204 3.542077 1.03282
H  4.315277 1.826185 1.440712
H  4.966743 2.379293 -0.113097
H  -3.740565 2.220777 0.036976
H  -3.282855 -2.045159 0.208431
elementType: Cl S P O C H
totalener: -2637.01052170 hartree
nucrepener: 2111.72466203 hartree
electener: -4748.73518373 hartree
oneelecener: -7835.59361975 hartree
twoeener: 3086.85843601 hartree
cpcmener: -0.01470974 hartree
kineticenergy: 2631.00577959 hartree
xcener: -154.148124908474 hartree
chargesum: -0.0000000
charge: -0.064507 -0.083238 -0.152088 -0.419648 0.628592 -0.348797 -0.336579 -0.097575 -0.100611 -0.252663 0.204665 0.046290 0.028481 -0.129277 -0.234634 -0.109921 -0.155024 0.073986 0.118581 0.128010 0.077013 0.064214 0.072859 0.085597 0.092012 0.108341 0.078802 0.137987 0.093336 0.079284 0.090704 0.129569 0.146241
qa: -0.0645 -0.0832 -0.1521 -0.4196 0.6286 -0.3488 -0.3366 -0.0976 -0.1006 -0.2527 0.2047 0.0463 0.0285 -0.1293 -0.2346 -0.1099 -0.1550 0.0740 0.1186 0.1280 0.0770 0.0642 0.0729 0.0856 0.0920 0.1083 0.0788 0.1380 0.0933 0.0793 0.0907 0.1296 0.1462
va: 1.2461 1.2173 2.2921 2.0113 5.3926 2.1159 2.1107 3.8574 3.9019 3.9307 3.7861 3.8385 3.9840 3.9724 3.9541 4.0219 4.0415 3.8682 1.0251 1.0074 1.0090 1.0275 1.0109 1.0010 1.0047 0.9962 1.0182 1.0059 1.0081 1.0118 1.0037 1.0161 1.0030
dispcorr: -0.017563247 hartree
energy: -2637.028084948598
dipole: 33.88718 -32.67859 1.20859 -17.77242 17.22447 -0.54795 5.18559 -5.30824 -0.12265
magnitude: 1.33266 au
magnitude: 3.38735 debye
