program: Orca
programVersion: 5.0.2
elementType: Cl Cl S S P O O C C C C C C C C C C C H H H H H H H H H H H H H H H
charge: 0
multiplicity: 1
keywords: wb97x-d3
keywords: def2-TZVPP
keywords: def2/J RIJCOSX
keywords: DEFGRID2
keywords: scfconv7
keywords: smallprint printgap noloewdin
keywords: NOSOSCF
formula: C11H15Cl2O2PS2
InChI: InChI=1/C11H15Cl2O2PS2/c1-3-7-18-16(17,14-4-2)15-11-6-5-9(12)8-10(11)13/h5-6,8H,3-4,7H2,1-2H3
33 atoms
Cl -0.993866 0.120248 -2.704775
Cl -5.34789 -0.847381 0.288817
S  1.497662 -1.13798 1.316963
S  1.48476 1.988521 2.305171
P  1.450273 0.850194 0.758141
O  0.17783 1.009231 -0.248184
O  2.53921 1.119442 -0.373425
C  1.42301 -2.065499 -0.265033
C  2.768527 -2.268694 -0.934648
C  2.628498 -3.156432 -2.162578
C  -1.089134 0.557529 -0.048224
C  3.818661 1.725434 -0.091344
C  -1.78359 0.12204 -1.174005
C  -1.721431 0.545212 1.185293
C  4.745386 0.825226 0.685052
C  -3.095739 -0.30816 -1.079768
C  -3.031357 0.107177 1.2944
C  -3.708888 -0.311711 0.162026
H  0.709298 -1.587541 -0.935831
H  0.98554 -3.022617 0.025756
H  3.188026 -1.304995 -1.224669
H  3.466926 -2.719536 -0.226195
H  2.243592 -4.143837 -1.901945
H  1.948539 -2.718352 -2.895555
H  3.592691 -3.298078 -2.651612
H  4.230073 1.951384 -1.07398
H  3.658575 2.670069 0.431913
H  -1.208154 0.893106 2.071604
H  5.711762 1.322701 0.777876
H  4.381634 0.628646 1.693271
H  4.907992 -0.126696 0.179643
H  -3.623939 -0.639008 -1.963317
H  -3.513136 0.103865 2.261938
elementType: Cl S P O C H
totalener: -2637.01066515 hartree
nucrepener: 2133.81553270 hartree
electener: -4770.82619784 hartree
oneelecener: -7879.12821724 hartree
twoeener: 3108.30201940 hartree
cpcmener: -0.01521512 hartree
kineticenergy: 2631.00115483 hartree
xcener: -154.153259996381 hartree
chargesum: -0.0000000
charge: -0.069818 -0.083452 -0.139672 -0.417694 0.596383 -0.318330 -0.341734 -0.074639 -0.092770 -0.266990 0.203093 0.033238 0.021773 -0.163128 -0.256567 -0.089427 -0.143138 0.057830 0.097692 0.128925 0.061992 0.070170 0.085554 0.081439 0.093894 0.114500 0.104942 0.145076 0.106437 0.082801 0.094920 0.130053 0.146647
qa: -0.0698 -0.0835 -0.1397 -0.4177 0.5964 -0.3183 -0.3417 -0.0746 -0.0928 -0.2670 0.2031 0.0332 0.0218 -0.1631 -0.2566 -0.0894 -0.1431 0.0578 0.0977 0.1289 0.0620 0.0702 0.0856 0.0814 0.0939 0.1145 0.1049 0.1451 0.1064 0.0828 0.0949 0.1301 0.1466
va: 1.2426 1.2173 2.3145 2.0386 5.4326 2.1498 2.1001 3.8535 3.9029 3.9701 3.8281 3.8193 3.8968 3.9422 3.9066 3.9986 4.0405 3.8876 1.0330 1.0084 1.0224 1.0110 1.0012 1.0024 1.0042 0.9930 1.0128 1.0257 1.0109 1.0181 1.0008 1.0161 1.0029
dispcorr: -0.018835394 hartree
energy: -2637.029500539292
dipole: 35.90554 -34.80486 1.10068 -10.99644 9.82142 -1.17501 -2.92792 2.05276 -0.87515
magnitude: 1.83250 au
magnitude: 4.65783 debye
