program: Gaussian 09
title: 000066546
version: EM64L-G09RevD.01
frameworkgroup: C1[X(C17H15N3O6S2)]
method: RPBEPBE
basis: SDD
operation: Freq
keyword: #p
keyword: freq=noraman
keyword: PBEPBE/SDD
title: #p freq=noraman PBEPBE/SDD
converged: YES YES NO NO
title: Mulliken charges:
elementType: S S O O O O O O N N N C C C C C C C C C C C C C C C C C H H H H H H H H H H H H H H H
charge: 0.965860 0.964848 -0.560782 -0.558011 -0.495031 -0.499988 -0.500414 -0.499173 -0.131294 -0.062725 -0.678885 0.545144 0.515768 -0.263106 -0.261354 -0.482018 -0.381366 -0.451022 0.168549 -0.276875 -0.247335 -0.052647 0.440832 -0.603624 -0.263532 0.541038 -0.410759 -0.796491 0.322746 0.289109 0.315435 0.299634 0.250764 0.382895 0.232291 0.381415 0.278069 0.226467 0.239662 0.263124 0.211438 0.320754 0.320591
chargesum: 0.00000
title: Mulliken charges with hydrogens summed into heavy atoms:
elementType: S S O O O O O O N N N C C C C C C C C C C C C C C C C C
charge: 0.965860 0.964848 -0.177887 -0.176596 -0.495031 -0.499988 -0.500414 -0.499173 -0.131294 -0.062725 -0.037540 0.545144 0.515768 -0.263106 -0.261354 -0.159272 -0.092257 -0.135587 0.168549 0.022759 0.003428 -0.052647 0.440832 -0.371333 0.014537 0.541038 -0.184291 -0.082267
polarizability: 6.59622500e+02 4.74418064e+01 3.43171775e+02 -2.29327333e+00 7.89141735e-01 1.42737731e+02
1716.lowfreq: -4.2462 0.0004 0.0008 0.0015 3.3201 4.9278 14.9480 27.1026 29.8985
frequency: 14.8575 27.0706 29.8920 37.8245 40.1968 48.6778 86.1887 97.7932 106.1042 108.0862 118.3199 145.6422 153.4614 165.3148 166.3185 178.0376 186.3077 196.2275 205.2505 214.4931 221.9935 243.7324 258.5006 263.9376 274.3461 301.3490 311.1090 311.3797 325.9464 331.0427 345.2174 376.3460 397.8861 413.7937 425.6816 442.6994 458.8969 463.6103 470.6062 482.6504 486.4396 515.9098 528.9250 532.5543 536.6051 554.0445 586.4949 592.6053 601.7831 610.1207 666.6345 680.6988 719.8850 743.4606 752.2767 767.4051 807.4768 831.3982 831.8237 834.9376 846.6102 850.2927 868.7674 910.1338 932.9086 942.7225 944.6805 948.3056 958.3958 961.1709 986.3233 991.2213 994.7600 995.7636 1044.0671 1046.9096 1047.4764 1052.4482 1077.6597 1094.9796 1118.5895 1167.8208 1175.1292 1189.3502 1203.1538 1245.9085 1263.8596 1280.7520 1319.0819 1331.4616 1344.6845 1374.1610 1395.6334 1401.9119 1417.0519 1425.1251 1435.3309 1450.4149 1456.8766 1492.8434 1494.2831 1500.0052 1546.4847 1553.8841 1591.7821 1621.7934 1630.1129 1649.9848 2992.9909 3076.9552 3097.1923 3122.2031 3128.6183 3152.5385 3160.5069 3163.0917 3165.7981 3175.2280 3180.0845 3478.0968 3479.0429 3551.4294 3691.1641
redmass: 3.9317 7.5320 6.9502 8.9430 9.1220 7.4720 5.5656 5.6673 2.5996 1.8432 4.0200 6.3059 6.4346 4.3361 1.8154 2.8966 3.0821 4.9838 3.4004 5.3823 3.5059 3.0757 5.7717 4.9417 4.2821 6.0895 6.4366 3.7842 9.3842 8.1608 7.1129 4.4634 6.3896 8.5234 7.2381 1.0455 8.0037 2.8426 5.5931 1.2873 4.4080 6.7931 4.6317 5.0780 11.7720 8.0659 3.6764 5.4163 4.6112 5.4057 3.5134 7.8289 5.8451 6.3224 3.1440 1.5356 7.1399 7.0783 1.5933 8.4728 2.5286 6.4087 1.5785 6.3363 3.0769 1.4644 1.4114 2.2576 5.0383 9.2760 1.3517 3.7710 1.5195 1.5035 1.5713 1.1701 1.1778 1.4825 2.1579 2.2299 1.9705 1.6918 1.7033 1.8036 1.6802 2.2831 1.6764 2.2852 3.9245 2.6196 2.6634 3.7559 2.5081 1.6302 4.0283 3.5569 3.2076 1.5071 1.0800 2.6353 3.7254 2.5917 7.7075 7.3251 6.3486 7.2585 4.9364 1.2391 1.0368 1.0963 1.1007 1.0914 1.0896 1.0887 1.0922 1.0917 1.0949 1.0915 1.0993 1.0661 1.0661 1.0453 1.1040
irintensity: 0.1396 2.2318 1.0289 0.2251 0.0309 2.1079 0.4988 0.8193 0.5271 1.9902 0.0972 9.3190 10.3086 20.3441 31.6151 24.3822 9.5866 1.7587 6.1083 6.2515 4.5376 70.1828 10.7418 15.3704 6.2982 31.4029 39.1951 8.6982 8.6418 1.4849 5.8384 14.0406 65.3390 25.1373 110.0737 0.9213 14.4867 24.1022 41.0644 259.3939 7.1522 14.5346 17.7150 2.6379 177.5452 46.9466 7.0077 15.0794 1.3557 21.2394 19.3670 14.7019 0.4670 2.4505 0.3182 26.6903 22.7901 91.1343 22.1892 33.1038 52.7890 14.4111 41.4112 6.4620 0.2955 2.3303 14.2411 69.5364 101.9837 27.8401 0.2531 2.7941 4.1544 5.6831 22.5809 43.6522 96.1222 16.3225 4.1820 72.5769 47.7319 29.7072 76.1956 20.4434 31.7489 31.9055 361.4903 13.6008 759.3628 260.8999 80.3092 3.3500 22.5630 9.9126 0.3175 3.0089 47.9799 3.9237 13.5404 20.2616 24.8206 76.7005 23.5458 19.4264 52.0647 195.1359 362.9014 438.7186 15.4333 13.1832 22.1973 27.3272 30.5897 5.6429 10.0414 7.9340 11.4425 4.3695 3.1799 49.2499 38.2025 316.9474 26.7905
temp: 298.150 k
press: 1.00000 atm
elementType: 16 16 8 8 8 8 8 8 7 7 7 6 6 6 6 6 6 6 6 6 6 6 6 6 6 6 6 6 1 1 1 1 1 1 1 1 1 1 1 1 1 1 1
symmnumber: 1
zpe: 776473.8 jmol-1
zpe.correction: 0.295743 hartree
zpe.thermalcorrener: 0.323968 hartree
zpe.thermalcorrenthalpy: 0.324913 hartree
zpe.thermalcorrgfe: 0.235369 hartree
zpe.sumelectzpe: -2066.148187 hartree
zpe.sumelectthermal: -2066.119962 hartree
zpe.sumelectthermalent: -2066.119018 hartree
zpe.sumelectthermalfe: -2066.208561 hartree
dipole: -8.0165 -0.4638 2.3656
dipole: 8.3711
quadrupole: -91.7959 -194.6234 -187.1400
quadrupole: 12.4176 6.0903 1.0123
quadrupole: 66.0572 -36.7703 -29.2869 12.4176 6.0903 1.0123
hfenergy: -2066.4439303 hartree
pointgroup: C01 [X(C17H15N3O6S2)]
dipole: 3.1219602 0.401853 -0.9688378 debye
polarizability: 666.1103423|9.4486064|336.2627974|-10.6663876|6.3154086|143.1588664 unknown
InChI: InChI=1S/C17H15N3O6S2/c1-10-7-11(18)5-6-15(10)20-19-12-8-14-13(17(9-12)28(24,25)26)3-2-4-16(14)27(21,22)23/h2-9,21,24H,18H2,1H3
charge 0 multiplicity 1
43 atoms
S  -2.986165 -3.695236 -0.021371
S  -1.980714 3.320951 0.259907
O  -3.677869 -3.496814 -1.736362
O  -1.461486 3.291241 -1.525734
O  -1.871517 -4.865407 -0.018955
O  -4.24031 -3.795328 0.999508
O  -3.091139 4.476125 0.479639
O  -0.631972 3.348077 1.158117
N  1.421858 -1.030577 -0.073202
N  2.073625 0.117425 -0.072391
N  7.702351 0.040045 -0.066994
C  -2.08836 0.42637 0.133266
C  -2.884724 -0.801372 0.113248
C  -2.128403 -2.01365 0.014936
C  -2.842673 1.642347 0.222552
C  -0.667911 0.368846 0.064885
C  -4.31214 -0.733548 0.187427
C  -0.749232 -2.081859 -0.056849
C  0.00406 -0.863388 -0.024449
C  -4.226952 1.714238 0.287781
C  -4.968215 0.495799 0.274307
C  3.474744 0.032993 -0.082127
C  4.18417 1.287158 -0.082825
C  5.588359 1.264647 -0.07691
C  4.206658 -1.197776 -0.079479
C  6.31766 0.036785 -0.073918
C  5.599391 -1.20408 -0.076521
C  3.433308 2.603435 -0.095341
H  -0.064889 1.279483 0.098622
H  -4.89281 -1.659745 0.190824
H  -0.220348 -3.037683 -0.129045
H  -4.727115 2.685903 0.353023
H  -6.059847 0.533187 0.331059
H  -4.200451 -4.325225 -1.94637
H  6.139489 2.213082 -0.073676
H  -0.904922 4.10825 -1.687386
H  3.63672 -2.132055 -0.077358
H  6.153727 -2.150271 -0.073636
H  2.85584 2.715651 -1.030721
H  2.697469 2.65491 0.725247
H  4.128134 3.456047 -0.007984
H  8.224564 0.912681 -0.061109
H  8.226439 -0.831461 -0.061936
