program: Orca
programVersion: 5.0.2
elementType: Cl Cl S S P O O C C C C C C C C C C C H H H H H H H H H H H H H H H
charge: 0
multiplicity: 1
keywords: wb97x-d3
keywords: def2-TZVPP
keywords: def2/J RIJCOSX
keywords: DEFGRID2
keywords: scfconv7
keywords: smallprint printgap noloewdin
keywords: NOSOSCF
formula: C11H15Cl2O2PS2
InChI: InChI=1/C11H15Cl2O2PS2/c1-3-7-18-16(17,14-4-2)15-11-6-5-9(12)8-10(11)13/h5-6,8H,3-4,7H2,1-2H3
33 atoms
Cl -1.199658 2.979015 -0.839274
Cl -5.361879 -0.145707 0.509696
S  2.102941 -1.650847 -1.070106
S  1.229205 -0.048638 1.838027
P  1.555923 0.061321 -0.051993
O  0.265733 0.493052 -0.962395
O  2.627418 1.132688 -0.542373
C  3.352544 -2.366134 0.072065
C  2.773373 -3.394709 1.023852
C  2.184914 -4.611296 0.331082
C  -1.029564 0.306453 -0.584492
C  2.827304 2.38509 0.157952
C  -1.854721 1.421777 -0.50708
C  -1.549169 -0.948803 -0.312479
C  4.082764 2.320402 0.988157
C  -3.194773 1.290413 -0.181167
C  -2.883205 -1.094616 0.027317
C  -3.693462 0.027326 0.090274
H  3.84658 -1.553306 0.604482
H  4.099038 -2.813241 -0.585893
H  3.589228 -3.706628 1.682484
H  2.025674 -2.921687 1.663087
H  1.319248 -4.352429 -0.28089
H  2.917577 -5.096203 -0.316884
H  1.85274 -5.349077 1.062304
H  2.900459 3.144741 -0.619306
H  1.959563 2.623419 0.775806
H  -0.918983 -1.826209 -0.379495
H  4.244041 3.284069 1.47336
H  4.006765 1.562038 1.767652
H  4.958048 2.1045 0.374635
H  -3.831126 2.163104 -0.130956
H  -3.279348 -2.07851 0.236315
elementType: Cl S P O C H
totalener: -2637.00994615 hartree
nucrepener: 2112.48364911 hartree
electener: -4749.49359526 hartree
oneelecener: -7837.11362171 hartree
twoeener: 3087.62002645 hartree
cpcmener: -0.01480442 hartree
kineticenergy: 2631.01842501 hartree
xcener: -154.151285378008 hartree
chargesum: -0.0000000
charge: -0.064497 -0.083457 -0.152729 -0.419775 0.631867 -0.348203 -0.339830 -0.098356 -0.101039 -0.254334 0.208729 0.052722 0.024823 -0.131502 -0.241405 -0.109684 -0.155007 0.073999 0.117830 0.128658 0.077192 0.065305 0.074081 0.086034 0.091974 0.108961 0.080086 0.136810 0.096625 0.077514 0.091453 0.129105 0.146052
qa: -0.0645 -0.0835 -0.1527 -0.4198 0.6319 -0.3482 -0.3398 -0.0984 -0.1010 -0.2543 0.2087 0.0527 0.0248 -0.1315 -0.2414 -0.1097 -0.1550 0.0740 0.1178 0.1287 0.0772 0.0653 0.0741 0.0860 0.0920 0.1090 0.0801 0.1368 0.0966 0.0775 0.0915 0.1291 0.1461
va: 1.2465 1.2172 2.2910 2.0082 5.3903 2.1200 2.1069 3.8664 3.8995 3.9306 3.7883 3.8409 3.9818 3.9686 3.9380 4.0221 4.0437 3.8684 1.0219 1.0066 1.0091 1.0279 1.0103 1.0007 1.0050 0.9954 1.0176 1.0074 1.0084 1.0162 1.0037 1.0165 1.0032
dispcorr: -0.017582703 hartree
energy: -2637.027528852876
dipole: 34.88923 -33.54495 1.34428 -17.77240 17.24222 -0.53018 7.07818 -7.10821 -0.03003
magnitude: 1.44536 au
magnitude: 3.67381 debye
