program: Orca
programVersion: 5.0.2
elementType: Cl Cl S S P O O C C C C C C C C C C C H H H H H H H H H H H H H H H
charge: 0
multiplicity: 1
keywords: wb97x-d3
keywords: def2-TZVPP
keywords: def2/J RIJCOSX
keywords: DEFGRID2
keywords: scfconv7
keywords: smallprint printgap noloewdin
keywords: NOSOSCF
formula: C11H15Cl2O2PS2
InChI: InChI=1/C11H15Cl2O2PS2/c1-3-7-18-16(17,14-4-2)15-11-6-5-9(12)8-10(11)13/h5-6,8H,3-4,7H2,1-2H3
33 atoms
Cl -1.18202 2.788414 0.292711
Cl -5.197942 -0.763648 0.143141
S  2.117379 -1.586102 -1.006021
S  1.315205 0.377921 1.703858
P  1.614713 0.252344 -0.187836
O  0.334728 0.690955 -1.120139
O  2.719011 1.200369 -0.830963
C  2.718133 -2.568859 0.422552
C  1.80685 -3.743526 0.731906
C  0.447817 -3.354477 1.285699
C  -0.945283 0.332797 -0.806527
C  2.774603 2.612843 -0.51271
C  -1.771907 1.230889 -0.138966
C  -1.44925 -0.898736 -1.193651
C  3.916509 2.893926 0.430412
C  -3.084782 0.89913 0.153513
C  -2.75917 -1.244473 -0.907365
C  -3.562591 -0.343685 -0.227823
H  2.823702 -1.905408 1.281593
H  3.714725 -2.9080 0.141537
H  1.689579 -4.362782 -0.160783
H  2.336089 -4.363785 1.461244
H  0.542355 -2.799355 2.219234
H  -0.112434 -2.731438 0.587224
H  -0.153168 -4.242353 1.485415
H  2.912181 3.12292 -1.465852
H  1.827135 2.953845 -0.090952
H  -0.816475 -1.58994 -1.734266
H  3.767287 2.40558 1.393664
H  4.869681 2.565872 0.01441
H  3.979658 3.968793 0.604969
H  -3.720024 1.603428 0.672855
H  -3.142564 -2.207337 -1.21514
elementType: Cl S P O C H
totalener: -2637.00800737 hartree
nucrepener: 2151.43451668 hartree
electener: -4788.44252405 hartree
oneelecener: -7915.19933247 hartree
twoeener: 3126.75680841 hartree
cpcmener: -0.01398609 hartree
kineticenergy: 2631.01284853 hartree
xcener: -154.151445261964 hartree
chargesum: 0.0000000
charge: -0.062217 -0.082112 -0.161651 -0.406389 0.630556 -0.356222 -0.342933 -0.085995 -0.082480 -0.249407 0.251670 0.040013 0.010708 -0.204413 -0.236177 -0.095921 -0.122545 0.059102 0.103243 0.127935 0.067312 0.074145 0.082054 0.053389 0.097849 0.106961 0.087002 0.160403 0.075318 0.090960 0.093801 0.128943 0.147098
qa: -0.0622 -0.0821 -0.1617 -0.4064 0.6306 -0.3562 -0.3429 -0.0860 -0.0825 -0.2494 0.2517 0.0400 0.0107 -0.2044 -0.2362 -0.0959 -0.1225 0.0591 0.1032 0.1279 0.0673 0.0741 0.0821 0.0534 0.0978 0.1070 0.0870 0.1604 0.0753 0.0910 0.0938 0.1289 0.1471
va: 1.2456 1.2190 2.3050 2.0327 5.3960 2.0892 2.1193 3.8453 3.8935 3.9465 3.7649 3.8704 3.9920 3.9820 3.9344 4.0022 3.9999 3.8908 1.0463 1.0114 1.0106 1.0091 1.0062 1.0041 1.0095 0.9961 1.0082 0.9999 1.0189 1.0043 1.0079 1.0155 1.0022
dispcorr: -0.018799170 hartree
energy: -2637.026806544502
dipole: 26.90723 -26.11124 0.79599 -13.03373 12.36629 -0.66743 4.50281 -4.94510 -0.44229
magnitude: 1.12902 au
magnitude: 2.86974 debye
