program: Orca
programVersion: 5.0.2
elementType: Cl Cl S S P O O C C C C C C C C C C C H H H H H H H H H H H H H H H
charge: 0
multiplicity: 1
keywords: wb97x-d3
keywords: def2-TZVPP
keywords: def2/J RIJCOSX
keywords: DEFGRID2
keywords: scfconv7
keywords: smallprint printgap noloewdin
keywords: NOSOSCF
formula: C11H15Cl2O2PS2
InChI: InChI=1/C11H15Cl2O2PS2/c1-3-7-18-16(17,14-4-2)15-11-6-5-9(12)8-10(11)13/h5-6,8H,3-4,7H2,1-2H3
33 atoms
Cl -1.286351 2.533685 1.267241
Cl -4.953068 0.167463 -1.865734
S  2.007859 -1.406248 -0.565729
S  2.704068 0.766158 1.971019
P  1.498017 0.247487 0.575682
O  0.023845 -0.077365 1.207615
O  1.128039 1.282708 -0.575473
C  2.541205 -2.561937 0.757118
C  2.69628 -3.963322 0.188003
C  1.389796 -4.601434 -0.255332
C  -1.117724 -0.029632 0.458023
C  1.945073 2.418136 -0.925754
C  -1.853582 1.150058 0.414297
C  -1.572275 -1.147366 -0.220685
C  3.135707 2.02021 -1.76136
C  -3.041902 1.215083 -0.29243
C  -2.754866 -1.094494 -0.941082
C  -3.475513 0.087816 -0.971953
H  1.798013 -2.556496 1.555105
H  3.483924 -2.194541 1.159426
H  3.417297 -3.957182 -0.633427
H  3.146435 -4.567128 0.98016
H  0.94012 -4.076498 -1.09928
H  1.551127 -5.634247 -0.565488
H  0.661046 -4.611899 0.557343
H  1.278082 3.076243 -1.480019
H  2.252452 2.938924 -0.017248
H  -1.00664 -2.068553 -0.176538
H  3.841268 1.406209 -1.200752
H  2.83445 1.477096 -2.65729
H  3.662384 2.9210 -2.078501
H  -3.613329 2.132661 -0.31661
H  -3.1048 -1.970718 -1.468843
elementType: Cl S P O C H
totalener: -2637.01000551 hartree
nucrepener: 2135.88839094 hartree
electener: -4772.89839645 hartree
oneelecener: -7883.75292182 hartree
twoeener: 3110.85452537 hartree
cpcmener: -0.01610536 hartree
kineticenergy: 2631.01751867 hartree
xcener: -154.152424791601 hartree
chargesum: -0.0000000
charge: -0.067420 -0.082666 -0.157892 -0.408789 0.611625 -0.344966 -0.333356 -0.093254 -0.098604 -0.270599 0.194974 0.036360 0.023682 -0.125208 -0.242933 -0.109485 -0.172063 0.082374 0.111615 0.122080 0.073667 0.079662 0.076144 0.101624 0.083918 0.105713 0.097225 0.160780 0.078735 0.092743 0.101091 0.129665 0.143558
qa: -0.0674 -0.0827 -0.1579 -0.4088 0.6116 -0.3450 -0.3334 -0.0933 -0.0986 -0.2706 0.1950 0.0364 0.0237 -0.1252 -0.2429 -0.1095 -0.1721 0.0824 0.1116 0.1221 0.0737 0.0797 0.0761 0.1016 0.0839 0.1057 0.0972 0.1608 0.0787 0.0927 0.1011 0.1297 0.1436
va: 1.2455 1.2181 2.3023 2.0540 5.4070 2.1104 2.0900 3.8958 3.9085 3.9370 3.8607 3.8485 3.9486 3.9907 3.9135 4.0204 4.0532 3.8683 1.0106 1.0162 1.0116 1.0055 1.0066 1.0060 0.9993 0.9908 1.0101 0.9796 1.0173 1.0029 1.0111 1.0159 1.0058
dispcorr: -0.017900372 hartree
energy: -2637.027905886160
dipole: 27.03404 -26.76780 0.26623 -20.59036 19.50595 -1.08441 -6.77356 5.55610 -1.21746
magnitude: 1.65198 au
magnitude: 4.19899 debye
