program: Orca
programVersion: 5.0.2
elementType: Cl Cl S S P O O C C C C C C C C C C C H H H H H H H H H H H H H H H
charge: 0
multiplicity: 1
keywords: wb97x-d3
keywords: def2-TZVPP
keywords: def2/J RIJCOSX
keywords: DEFGRID2
keywords: scfconv7
keywords: smallprint printgap noloewdin
keywords: NOSOSCF
formula: C11H15Cl2O2PS2
InChI: InChI=1/C11H15Cl2O2PS2/c1-3-7-18-16(17,14-4-2)15-11-6-5-9(12)8-10(11)13/h5-6,8H,3-4,7H2,1-2H3
33 atoms
Cl -0.893635 2.045202 -2.165891
Cl -5.496626 0.384529 0.049419
S  1.634714 -2.181942 0.718282
S  1.114634 0.481328 2.620235
P  1.470306 -0.130709 0.838405
O  0.349883 0.287083 -0.280955
O  2.766281 0.405222 0.09248
C  2.013115 -2.475244 -1.059173
C  3.496543 -2.621869 -1.343633
C  4.126606 -3.838545 -0.687985
C  -1.000325 0.263745 -0.143971
C  3.297163 1.737816 0.288367
C  -1.728032 1.079539 -1.008258
C  -1.683294 -0.525211 0.770851
C  2.483937 2.804235 -0.401545
C  -3.110497 1.119589 -0.958173
C  -3.066925 -0.489477 0.83369
C  -3.770108 0.334126 -0.027245
H  1.56034 -1.682171 -1.653246
H  1.47626 -3.393813 -1.302313
H  3.602828 -2.697162 -2.429824
H  4.024611 -1.714438 -1.047134
H  3.645928 -4.761046 -1.019431
H  5.1853 -3.910227 -0.939427
H  4.055051 -3.798435 0.400546
H  3.380668 1.934181 1.3590
H  4.30333 1.687375 -0.123422
H  -1.153262 -1.182901 1.445395
H  3.021768 3.750119 -0.323347
H  2.347584 2.585883 -1.460301
H  1.50637 2.946145 0.058629
H  -3.659163 1.759663 -1.635579
H  -3.582586 -1.107836 1.55537
elementType: Cl S P O C H
totalener: -2637.01081229 hartree
nucrepener: 2114.53176102 hartree
electener: -4751.54257332 hartree
oneelecener: -7840.81618047 hartree
twoeener: 3089.27360716 hartree
cpcmener: -0.01473333 hartree
kineticenergy: 2630.99882081 hartree
xcener: -154.151181818656 hartree
chargesum: -0.0000000
charge: -0.067768 -0.085764 -0.159619 -0.412338 0.606645 -0.312563 -0.328704 -0.112230 -0.098456 -0.253681 0.295926 0.025916 -0.012737 -0.166794 -0.232041 -0.093985 -0.148494 0.051116 0.127105 0.127844 0.073806 0.069256 0.083402 0.092161 0.074412 0.096740 0.105104 0.120032 0.101387 0.085564 0.075052 0.127656 0.146049
qa: -0.0678 -0.0858 -0.1596 -0.4123 0.6066 -0.3126 -0.3287 -0.1122 -0.0985 -0.2537 0.2959 0.0259 -0.0127 -0.1668 -0.2320 -0.0940 -0.1485 0.0511 0.1271 0.1278 0.0738 0.0693 0.0834 0.0922 0.0744 0.0967 0.1051 0.1200 0.1014 0.0856 0.0751 0.1277 0.1460
va: 1.2453 1.2152 2.2936 2.0434 5.4006 2.1202 2.1253 3.8668 3.8980 3.9266 3.7147 3.8685 3.9827 3.9744 3.8880 3.9957 4.0550 3.8922 1.0279 1.0046 1.0086 1.0227 1.0006 1.0046 1.0133 1.0072 0.9903 1.0369 1.0110 1.0078 1.0208 1.0170 1.0035
dispcorr: -0.017885989 hartree
energy: -2637.028698280367
dipole: 35.11840 -33.98138 1.13702 -12.00494 11.54417 -0.46078 -4.77071 3.27933 -1.49138
magnitude: 1.93115 au
magnitude: 4.90860 debye
