program: Orca
programVersion: 5.0.2
elementType: Cl Cl S S P O O C C C C C C C C C C C H H H H H H H H H H H H H H H
charge: 0
multiplicity: 1
keywords: wb97x-d3
keywords: def2-TZVPP
keywords: def2/J RIJCOSX
keywords: DEFGRID2
keywords: scfconv7
keywords: smallprint printgap noloewdin
keywords: NOSOSCF
formula: C11H15Cl2O2PS2
InChI: InChI=1/C11H15Cl2O2PS2/c1-3-7-18-16(17,14-4-2)15-11-6-5-9(12)8-10(11)13/h5-6,8H,3-4,7H2,1-2H3
33 atoms
Cl -1.602018 -0.842191 2.119227
Cl -5.112687 0.196218 -1.81262
S  1.092304 -1.369978 -0.216229
S  2.783428 0.953408 1.665427
P  1.445118 0.600894 0.338847
O  0.01621 1.221899 0.823573
O  1.568036 1.305295 -1.090533
C  1.778339 -2.317865 1.195095
C  3.233217 -2.701363 1.000812
C  3.480661 -3.61369 -0.187894
C  -1.160748 0.969776 0.174333
C  2.699117 1.074495 -1.960691
C  -2.033047 0.018912 0.693373
C  -1.521777 1.686645 -0.954659
C  3.757813 2.13213 -1.78167
C  -3.254309 -0.224613 0.086876
C  -2.739301 1.454158 -1.571296
C  -3.591181 0.495333 -1.04796
H  1.139738 -3.200029 1.265465
H  1.631835 -1.73997 2.106282
H  3.838838 -1.796748 0.918732
H  3.55289 -3.202387 1.919387
H  2.898557 -4.534357 -0.113643
H  3.221296 -3.131226 -1.131877
H  4.532912 -3.894008 -0.247364
H  3.108764 0.075173 -1.791639
H  2.289888 1.092879 -2.970068
H  -0.859906 2.446592 -1.346774
H  4.21476 2.085975 -0.79397
H  4.54331 1.971112 -2.521492
H  3.355827 3.133725 -1.936028
H  -3.926557 -0.966135 0.496186
H  -3.013896 2.02113 -2.44989
elementType: Cl S P O C H
totalener: -2637.00963281 hartree
nucrepener: 2142.99434144 hartree
electener: -4780.00397425 hartree
oneelecener: -7897.99493671 hartree
twoeener: 3117.99096247 hartree
cpcmener: -0.01542491 hartree
kineticenergy: 2631.01372036 hartree
xcener: -154.152466336055 hartree
chargesum: 0.0000000
charge: -0.062064 -0.081689 -0.171123 -0.406081 0.619025 -0.335249 -0.338908 -0.085887 -0.098796 -0.254529 0.174292 0.046692 0.017546 -0.127465 -0.240000 -0.103353 -0.139147 0.066117 0.130340 0.110876 0.060125 0.077879 0.085147 0.074007 0.092587 0.087673 0.108873 0.152395 0.077270 0.093979 0.089850 0.132107 0.147510
qa: -0.0621 -0.0817 -0.1711 -0.4061 0.6190 -0.3352 -0.3389 -0.0859 -0.0988 -0.2545 0.1743 0.0467 0.0175 -0.1275 -0.2400 -0.1034 -0.1391 0.0661 0.1303 0.1109 0.0601 0.0779 0.0851 0.0740 0.0926 0.0877 0.1089 0.1524 0.0773 0.0940 0.0898 0.1321 0.1475
va: 1.2495 1.2187 2.2941 2.0468 5.4231 2.1350 2.1008 3.8285 3.9199 3.9306 3.8444 3.8557 3.9549 3.9743 3.9345 4.0201 3.9959 3.8815 1.0065 1.0369 1.0281 1.0088 1.0012 1.0119 1.0048 1.0023 0.9931 1.0073 1.0218 1.0082 1.0040 1.0151 1.0017
dispcorr: -0.018000834 hartree
energy: -2637.027633639985
dipole: 36.42891 -35.99110 0.43780 -8.68551 7.91760 -0.76792 -8.90418 7.37531 -1.52887
magnitude: 1.76602 au
magnitude: 4.48886 debye
