program: Orca
programVersion: 5.0.2
elementType: Cl Cl S S P O O C C C C C C C C C C C H H H H H H H H H H H H H H H
charge: 0
multiplicity: 1
keywords: wb97x-d3
keywords: def2-TZVPP
keywords: def2/J RIJCOSX
keywords: DEFGRID2
keywords: scfconv7
keywords: smallprint printgap noloewdin
keywords: NOSOSCF
formula: C11H15Cl2O2PS2
InChI: InChI=1/C11H15Cl2O2PS2/c1-3-7-18-16(17,14-4-2)15-11-6-5-9(12)8-10(11)13/h5-6,8H,3-4,7H2,1-2H3
33 atoms
Cl -0.800811 1.364799 -2.478147
Cl -5.148073 -0.589425 0.003132
S  2.109101 -1.723279 1.00137
S  1.461814 1.062392 2.698062
P  1.78341 0.308302 0.962405
O  0.596167 0.537695 -0.141298
O  3.006564 0.875801 0.120111
C  2.472913 -2.127968 -0.763017
C  1.615259 -3.277521 -1.26101
C  0.137185 -2.947797 -1.369773
C  -0.723472 0.246676 -0.027643
C  3.421957 2.261229 0.164505
C  -1.524065 0.606355 -1.11023
C  -1.308417 -0.387899 1.059233
C  2.488438 3.179731 -0.583181
C  -2.884265 0.353444 -1.109824
C  -2.669478 -0.648484 1.069504
C  -3.447983 -0.273004 -0.01051
H  3.532007 -2.378214 -0.80211
H  2.321703 -1.243231 -1.380257
H  2.005965 -3.54357 -2.24741
H  1.764509 -4.158118 -0.631201
H  -0.30585 -2.739266 -0.395417
H  -0.029223 -2.077139 -2.007263
H  -0.413131 -3.783318 -1.803981
H  3.530749 2.568462 1.206398
H  4.411559 2.258334 -0.288737
H  -0.721536 -0.691247 1.914482
H  2.93294 4.175666 -0.609013
H  2.340235 2.855228 -1.613008
H  1.51601 3.270109 -0.098923
H  -3.489624 0.6424 -1.95818
H  -3.108008 -1.14398 1.924677
elementType: Cl S P O C H
totalener: -2637.01031551 hartree
nucrepener: 2156.24226729 hartree
electener: -4793.25258280 hartree
oneelecener: -7924.11773920 hartree
twoeener: 3130.86515641 hartree
cpcmener: -0.01486378 hartree
kineticenergy: 2630.99330394 hartree
xcener: -154.151949271396 hartree
chargesum: -0.0000000
charge: -0.070288 -0.086023 -0.155844 -0.414879 0.599386 -0.297603 -0.333664 -0.094920 -0.088879 -0.259405 0.300567 0.023914 -0.020528 -0.193936 -0.233408 -0.080606 -0.133895 0.045907 0.131103 0.099835 0.077251 0.073868 0.074454 0.073128 0.104345 0.095702 0.108384 0.117036 0.100714 0.086143 0.078475 0.127096 0.146571
qa: -0.0703 -0.0860 -0.1558 -0.4149 0.5994 -0.2976 -0.3337 -0.0949 -0.0889 -0.2594 0.3006 0.0239 -0.0205 -0.1939 -0.2334 -0.0806 -0.1339 0.0459 0.1311 0.0998 0.0773 0.0739 0.0745 0.0731 0.1043 0.0957 0.1084 0.1170 0.1007 0.0861 0.0785 0.1271 0.1466
va: 1.2407 1.2152 2.2982 2.0396 5.4075 2.1372 2.1175 3.8816 3.8912 3.9506 3.6664 3.8705 3.9463 3.9394 3.8909 3.9874 4.0429 3.9009 1.0102 1.0319 1.0074 1.0099 1.0047 1.0005 1.0053 1.0078 0.9905 1.0472 1.0109 1.0080 1.0186 1.0175 1.0020
dispcorr: -0.019848270 hartree
energy: -2637.030163775924
dipole: 21.50760 -20.54354 0.96406 -6.77903 6.29357 -0.48547 -6.01677 4.56485 -1.45192
magnitude: 1.80919 au
magnitude: 4.59858 debye
