program: Orca
programVersion: 5.0.2
elementType: Cl Cl S S P O O C C C C C C C C C C C H H H H H H H H H H H H H H H
charge: 0
multiplicity: 1
keywords: wb97x-d3
keywords: def2-TZVPP
keywords: def2/J RIJCOSX
keywords: DEFGRID2
keywords: scfconv7
keywords: smallprint printgap noloewdin
keywords: NOSOSCF
formula: C11H15Cl2O2PS2
InChI: InChI=1/C11H15Cl2O2PS2/c1-3-7-18-16(17,14-4-2)15-11-6-5-9(12)8-10(11)13/h5-6,8H,3-4,7H2,1-2H3
33 atoms
Cl -1.120524 2.799465 0.189737
Cl -5.084809 -0.819889 0.175794
S  2.508846 -1.534107 -0.628832
S  1.269718 0.380833 1.9323
P  1.723484 0.256618 0.071148
O  0.480454 0.613983 -0.943157
O  2.813517 1.251219 -0.524957
C  2.313709 -2.646947 0.813085
C  0.94645 -3.290641 0.935115
C  0.596486 -4.220372 -0.213268
C  -0.806861 0.261614 -0.665873
C  2.673716 2.686974 -0.399137
C  -1.67891 1.203856 -0.131042
C  -1.269929 -1.012397 -0.950931
C  4.045821 3.301255 -0.482838
C  -3.001033 0.878296 0.12315
C  -2.586523 -1.356199 -0.693424
C  -3.438261 -0.406969 -0.152592
H  2.579638 -2.086486 1.70845
H  3.089796 -3.399876 0.659948
H  0.945878 -3.855151 1.872294
H  0.186316 -2.514752 1.049741
H  0.602999 -3.705696 -1.175653
H  1.304184 -5.048913 -0.280681
H  -0.398139 -4.646836 -0.079006
H  2.031275 3.044793 -1.204829
H  2.199625 2.93069 0.553987
H  -0.600329 -1.739001 -1.391951
H  3.955263 4.385061 -0.405675
H  4.687436 2.960171 0.329672
H  4.531952 3.074965 -1.432205
H  -3.67412 1.618211 0.534047
H  -2.936586 -2.354334 -0.917648
elementType: Cl S P O C H
totalener: -2637.01093880 hartree
nucrepener: 2149.24856844 hartree
electener: -4786.25950724 hartree
oneelecener: -7910.51224755 hartree
twoeener: 3124.25274031 hartree
cpcmener: -0.01483026 hartree
kineticenergy: 2631.01344623 hartree
xcener: -154.150817296742 hartree
chargesum: 0.0000000
charge: -0.061514 -0.082652 -0.156917 -0.408578 0.611384 -0.351295 -0.336973 -0.090733 -0.116053 -0.265978 0.209830 0.043863 0.038451 -0.174498 -0.241405 -0.110021 -0.150219 0.078984 0.125374 0.128942 0.088199 0.059697 0.070696 0.093879 0.097802 0.101563 0.087777 0.171362 0.088169 0.087380 0.089574 0.128661 0.145249
qa: -0.0615 -0.0827 -0.1569 -0.4086 0.6114 -0.3513 -0.3370 -0.0907 -0.1161 -0.2660 0.2098 0.0439 0.0385 -0.1745 -0.2414 -0.1100 -0.1502 0.0790 0.1254 0.1289 0.0882 0.0597 0.0707 0.0939 0.0978 0.1016 0.0878 0.1714 0.0882 0.0874 0.0896 0.1287 0.1452
va: 1.2463 1.2183 2.3034 2.0372 5.3965 2.0806 2.1435 3.8229 3.8973 3.9268 3.8047 3.8378 3.9806 3.9559 3.9757 4.0166 4.0365 3.8789 1.0352 1.0065 1.0084 1.0209 1.0117 1.0035 1.0029 0.9984 1.0058 0.9795 1.0061 1.0063 1.0035 1.0163 1.0048
dispcorr: -0.019056298 hartree
energy: -2637.029995096768
dipole: 24.10783 -23.70053 0.40730 -13.59196 12.90172 -0.69024 -1.12916 0.59951 -0.52966
magnitude: 0.96065 au
magnitude: 2.44178 debye
