program: Orca
programVersion: 5.0.2
elementType: Cl Cl S S P O O C C C C C C C C C C C H H H H H H H H H H H H H H H
charge: 0
multiplicity: 1
keywords: wb97x-d3
keywords: def2-TZVPP
keywords: def2/J RIJCOSX
keywords: DEFGRID2
keywords: scfconv7
keywords: smallprint printgap noloewdin
keywords: NOSOSCF
formula: C11H15Cl2O2PS2
InChI: InChI=1/C11H15Cl2O2PS2/c1-3-7-18-16(17,14-4-2)15-11-6-5-9(12)8-10(11)13/h5-6,8H,3-4,7H2,1-2H3
33 atoms
Cl -0.598297 1.691206 -2.111059
Cl -5.424781 0.001109 -0.457445
S  1.207167 -1.097375 -0.91706
S  1.250086 -1.023267 2.492165
P  1.369511 -0.021762 0.860573
O  0.21824 1.119634 0.619382
O  2.663938 0.896647 0.818244
C  1.957951 -2.690817 -0.428594
C  3.465701 -2.647048 -0.261332
C  4.006054 -4.013739 0.134881
C  -1.093188 0.822608 0.389074
C  3.042547 1.719555 -0.310494
C  -1.62076 1.066503 -0.874401
C  -1.914048 0.333641 1.391908
C  2.745057 3.174549 -0.048518
C  -2.956682 0.82243 -1.142902
C  -3.25054 0.077246 1.135768
C  -3.757916 0.319806 -0.130219
H  1.674415 -3.367691 -1.237293
H  1.456294 -3.035647 0.476769
H  3.928215 -2.314268 -1.19302
H  3.735663 -1.915234 0.503343
H  3.584225 -4.346653 1.084878
H  3.772906 -4.770505 -0.616311
H  5.090252 -3.985389 0.248097
H  4.111995 1.557181 -0.43979
H  2.550514 1.375013 -1.222328
H  -1.512577 0.162398 2.381565
H  1.676056 3.371145 0.021525
H  3.226926 3.524787 0.864364
H  3.13687 3.764979 -0.877568
H  -3.358652 1.017926 -2.127528
H  -3.884877 -0.305563 1.923194
elementType: Cl S P O C H
totalener: -2637.01133191 hartree
nucrepener: 2139.44314121 hartree
electener: -4776.45447312 hartree
oneelecener: -7890.80466025 hartree
twoeener: 3114.35018713 hartree
cpcmener: -0.01467687 hartree
kineticenergy: 2631.00528695 hartree
xcener: -154.150579730467 hartree
chargesum: -0.0000000
charge: -0.064143 -0.081818 -0.181486 -0.409732 0.613292 -0.346445 -0.330802 -0.072603 -0.097660 -0.263947 0.225961 0.034715 0.003512 -0.182326 -0.233714 -0.086616 -0.122956 0.051439 0.130890 0.114069 0.071742 0.063710 0.083182 0.084108 0.093430 0.113149 0.090104 0.157541 0.076409 0.091542 0.095435 0.132722 0.147296
qa: -0.0641 -0.0818 -0.1815 -0.4097 0.6133 -0.3464 -0.3308 -0.0726 -0.0977 -0.2639 0.2260 0.0347 0.0035 -0.1823 -0.2337 -0.0866 -0.1230 0.0514 0.1309 0.1141 0.0717 0.0637 0.0832 0.0841 0.0934 0.1131 0.0901 0.1575 0.0764 0.0915 0.0954 0.1327 0.1473
va: 1.2473 1.2187 2.3200 2.0531 5.4101 2.1035 2.1082 3.8572 3.8813 3.9577 3.7837 3.8376 3.9791 4.0501 3.9374 3.9822 4.0133 3.8915 1.0027 1.0312 1.0159 1.0260 1.0024 1.0006 1.0040 0.9945 1.0099 1.0056 1.0186 1.0058 1.0062 1.0132 1.0019
dispcorr: -0.018037799 hartree
energy: -2637.029369711329
dipole: 34.49791 -33.75438 0.74353 -10.91775 10.87103 -0.04672 2.24060 -3.46966 -1.22906
magnitude: 1.43722 au
magnitude: 3.65312 debye
