program: Gaussian 09
title: 000066475
version: EM64L-G09RevD.01
frameworkgroup: C1[X(C24H10N2O4)]
method: RPBEPBE
basis: SDD
operation: Freq
keyword: #p
keyword: freq=noraman
keyword: PBEPBE/SDD
title: #p freq=noraman PBEPBE/SDD
converged: NO NO NO NO
title: Mulliken charges:
elementType: O O O O N N C C C C C C C C C C C C C C C C C C C C C C C C H H H H H H H H H H
charge: -0.227487 -0.227483 -0.227480 -0.227485 -0.388132 -0.388128 -0.070512 -0.070509 0.312690 0.312720 0.312715 0.312723 0.227953 0.227952 0.145889 0.145904 0.145885 0.145876 -0.421701 -0.421709 -0.421698 -0.421707 -0.444420 -0.444424 -0.444424 -0.444421 0.044282 0.044278 0.044281 0.044284 0.244032 0.244033 0.244031 0.244031 0.283578 0.283575 0.283576 0.283577 0.356927 0.356927
chargesum: 0.00000
title: Mulliken charges with hydrogens summed into heavy atoms:
elementType: O O O O N N C C C C C C C C C C C C C C C C C C C C C C C C
charge: -0.227487 -0.227483 -0.227480 -0.227485 -0.031205 -0.031201 -0.070512 -0.070509 0.312690 0.312720 0.312715 0.312723 0.227953 0.227952 0.145889 0.145904 0.145885 0.145876 -0.177669 -0.177676 -0.177667 -0.177675 -0.160842 -0.160848 -0.160848 -0.160844 0.044282 0.044278 0.044281 0.044284
polarizability: 6.82178543e+02 1.06504220e-03 3.47130993e+02 -1.95476670e-03 8.36214521e-03 1.01851450e+02
1716.lowfreq: -0.0008 -0.0004 0.0003 2.1949 4.7867 13.0334 31.5066 38.5970 76.0430
frequency: 31.5066 38.5970 76.0253 91.4244 93.3430 135.1518 155.4512 157.2697 193.6254 200.3264 219.3829 223.4966 240.8330 268.0565 312.6047 329.2382 344.8862 348.0252 372.7370 378.2326 417.4291 423.6724 443.5434 451.3996 457.9916 462.6981 473.6277 495.0151 528.0207 530.8466 558.4221 560.4352 593.6617 626.8611 633.1371 642.0595 642.7975 647.2477 667.5832 706.6839 708.4040 717.2207 717.9739 733.2708 747.0384 747.2453 787.9899 789.1028 800.5180 802.9131 812.2048 813.1735 846.7679 874.5466 878.7867 878.8953 905.6656 927.4440 941.5424 997.5856 999.4285 1003.9944 1004.2460 1023.9369 1055.0512 1099.0637 1116.2330 1139.8600 1174.1304 1175.6925 1181.2280 1185.4181 1201.9309 1207.0033 1263.4115 1279.4645 1283.5356 1312.9263 1316.2655 1320.2116 1353.8369 1359.0429 1362.6466 1365.7524 1367.1484 1397.6877 1402.2365 1415.0167 1426.6471 1444.3796 1452.1479 1479.9490 1523.5306 1529.8868 1565.0130 1566.3485 1579.2194 1591.4037 1592.4349 1603.1061 1619.9215 1621.0547 1628.5200 1630.5463 3151.9706 3151.9980 3156.7189 3156.7886 3169.5383 3169.8512 3176.8534 3177.5113 3494.5555 3494.6742
redmass: 8.1617 8.9083 9.0251 6.4286 6.1583 9.8862 8.0956 8.5915 4.9164 4.4933 6.0936 11.7613 11.0875 5.6627 4.6725 8.0159 12.1457 6.1791 10.2666 7.3889 8.5576 8.0327 5.6597 9.0341 6.6310 3.3728 3.4382 8.5862 9.1455 4.5315 6.7605 6.4248 7.9497 4.4263 4.8567 6.5808 8.2966 7.4099 2.9973 4.9775 6.6681 8.4799 2.7739 5.3745 6.6818 2.0841 5.3557 2.3156 1.6417 5.1310 3.0222 5.8460 2.4463 1.3992 1.7710 1.4313 5.4436 7.1896 3.8618 1.4225 1.4961 1.3756 1.3759 5.2719 3.2041 4.6753 2.7897 1.3992 3.5077 2.9664 2.0182 2.9317 1.4052 1.5690 5.4444 2.5472 5.0025 1.7474 2.6860 2.8263 3.2155 4.3231 4.3018 1.7503 2.3017 10.5160 5.2032 9.9504 6.7661 7.3149 2.7341 3.1159 5.4462 5.5978 4.4062 6.5549 7.3668 6.2550 8.4702 7.3207 10.2161 10.0178 5.2381 5.7896 1.0884 1.0884 1.0887 1.0887 1.0965 1.0964 1.0933 1.0930 1.0765 1.0765
irintensity: 0.0000 2.1656 0.0000 0.0000 0.0000 3.7201 0.0000 6.9835 17.8267 0.0000 3.1049 0.0000 0.0000 0.0000 0.0000 0.6581 63.1917 0.0000 0.0000 0.0000 0.0000 18.8802 0.0000 42.2440 0.0000 0.0000 0.5155 12.5416 0.0000 0.0000 0.0002 0.8334 0.7900 0.0001 0.0000 0.0000 0.0000 42.2070 0.0000 9.3727 16.8772 0.0005 5.9234 0.0000 0.0000 0.0000 23.4713 99.8135 0.0001 0.0000 206.0829 0.0008 0.0000 0.0000 0.0414 100.4195 6.2110 17.7382 0.0000 0.0000 0.0000 0.0001 2.4235 0.0000 0.0000 30.2679 0.0000 21.0360 39.3684 0.0000 0.0000 129.3102 3.3471 0.0000 0.0001 0.0000 216.6647 0.0000 14.7117 548.9434 52.1728 0.0000 3.5100 0.0000 5.3384 0.0000 156.0073 0.0000 0.3016 0.0000 0.0000 7.6335 12.4393 0.0000 0.0006 430.4440 0.0001 52.4217 945.9930 0.0002 0.0006 130.7911 705.6635 0.0018 3.9692 0.0135 2.6856 0.0017 0.0000 2.2257 16.1569 0.0008 175.5371 3.6823
temp: 298.150 k
press: 1.00000 atm
elementType: 8 8 8 8 7 7 6 6 6 6 6 6 6 6 6 6 6 6 6 6 6 6 6 6 6 6 6 6 6 6 1 1 1 1 1 1 1 1 1 1
symmnumber: 1
zpe: 736436.7 jmol-1
zpe.correction: 0.280494 hartree
zpe.thermalcorrener: 0.300633 hartree
zpe.thermalcorrenthalpy: 0.301577 hartree
zpe.thermalcorrgfe: 0.232270 hartree
zpe.sumelectzpe: -1329.153595 hartree
zpe.sumelectthermal: -1329.133456 hartree
zpe.sumelectthermalent: -1329.132512 hartree
zpe.sumelectthermalfe: -1329.201819 hartree
dipole: 0.0000 0.0001 0.0001
dipole: 0.0002
quadrupole: -223.4581 -169.4250 -171.6160
quadrupole: 0.0007 -0.0004 0.0031
quadrupole: -35.2917 18.7414 16.5503 0.0007 -0.0004 0.0031
hfenergy: -1329.434089 hartree
pointgroup: C01 [X(C24H10N2O4)]
dipole: -0.0000101 0.0000402 -0.0000498 debye
polarizability: 682.1785431|-0.0006521|347.1309932|-0.0019548|-0.0083621|101.8514498 unknown
InChI: InChI=1S/C24H10N2O4/c27-21-13-5-1-9-10-2-6-15-20-16(24(30)26-23(15)29)8-4-12(18(10)20)11-3-7-14(22(28)25-21)19(13)17(9)11/h1-8,25-26H
charge 0 multiplicity 1
40 atoms
O  5.787458 2.324743 0.001414
O  -5.787474 2.324718 -0.001249
O  5.787462 -2.324746 -0.001367
O  -5.787437 -2.324769 0.001336
N  5.719028 -0.000002 0.000134
N  -5.719019 -0.000025 0.000223
C  1.446939 -0.000007 0.000091
C  -1.446924 -0.000007 0.000133
C  0.736851 1.258877 0.000171
C  -0.736838 1.258879 -0.000188
C  0.736849 -1.25888 -0.000006
C  -0.736837 -1.258878 0.000329
C  2.891665 -0.000002 0.000069
C  -2.891652 -0.000008 0.000134
C  3.605679 1.242641 0.000464
C  -3.605673 1.242645 -0.000454
C  3.60568 -1.24265 -0.000391
C  -3.605665 -1.242649 0.000592
C  1.48805 2.459993 0.000561
C  -1.488034 2.459991 -0.000862
C  1.488047 -2.459999 -0.000506
C  -1.488032 -2.4600 0.000805
C  2.899794 2.455194 0.000743
C  -2.899787 2.455189 -0.00101
C  2.899789 -2.455199 -0.000716
C  -2.899775 -2.455199 0.000954
C  5.095465 1.26724 0.000727
C  -5.095459 1.26723 -0.000528
C  5.095468 -1.267251 -0.000684
C  -5.095458 -1.267259 0.000766
H  0.979376 3.427233 0.000745
H  -0.979379 3.427241 -0.001367
H  0.979363 -3.427231 -0.000751
H  -0.979363 -3.427242 0.001065
H  3.466707 3.39159 0.001139
H  -3.466675 3.391599 -0.001596
H  3.466691 -3.391601 -0.001196
H  -3.466691 -3.391595 0.001344
H  6.746512 -0.000006 0.000173
H  -6.7465 -0.000003 0.00026
