program: Orca
programVersion: 5.0.2
elementType: Cl Cl S S P O O C C C C C C C C C C C H H H H H H H H H H H H H H H
charge: 0
multiplicity: 1
keywords: wb97x-d3
keywords: def2-TZVPP
keywords: def2/J RIJCOSX
keywords: DEFGRID2
keywords: scfconv7
keywords: smallprint printgap noloewdin
keywords: NOSOSCF
formula: C11H15Cl2O2PS2
InChI: InChI=1/C11H15Cl2O2PS2/c1-3-7-18-16(17,14-4-2)15-11-6-5-9(12)8-10(11)13/h5-6,8H,3-4,7H2,1-2H3
33 atoms
Cl -1.168261 1.677492 -1.99444
Cl -4.810483 -1.959693 -0.452052
S  1.604513 -0.427465 -0.984613
S  2.085274 0.106546 2.348598
P  1.445492 0.81224 0.67895
O  -0.105533 1.325709 0.69195
O  2.033369 2.212856 0.196849
C  1.978375 -2.068062 -0.264762
C  0.780273 -2.817538 0.284119
C  -0.301126 -3.101801 -0.743259
C  -1.174817 0.521668 0.435928
C  3.39423 2.616608 0.44524
C  -1.798286 0.606669 -0.805712
C  -1.684768 -0.330481 1.401797
C  4.376598 1.964835 -0.495823
C  -2.923954 -0.15072 -1.085091
C  -2.805932 -1.099766 1.133924
C  -3.412761 -1.003532 -0.107978
H  2.755721 -1.936353 0.488373
H  2.426424 -2.609804 -1.101455
H  1.163551 -3.761067 0.684698
H  0.365539 -2.274649 1.135894
H  0.093703 -3.671946 -1.586608
H  -1.111508 -3.685085 -0.305129
H  -0.735315 -2.183113 -1.140033
H  3.386919 3.69726 0.310303
H  3.650776 2.412432 1.487302
H  -1.2125 -0.384097 2.374488
H  4.474753 0.893708 -0.315657
H  4.097244 2.118848 -1.538722
H  5.358232 2.415684 -0.342491
H  -3.403645 -0.077111 -2.052016
H  -3.197403 -1.763225 1.892939
elementType: Cl S P O C H
totalener: -2637.00975425 hartree
nucrepener: 2191.52049421 hartree
electener: -4828.53024846 hartree
oneelecener: -7995.09050608 hartree
twoeener: 3166.56025762 hartree
cpcmener: -0.01482398 hartree
kineticenergy: 2631.00690784 hartree
xcener: -154.155150295050 hartree
chargesum: 0.0000000
charge: -0.060918 -0.082077 -0.161376 -0.417468 0.610056 -0.336296 -0.343533 -0.086499 -0.096460 -0.278754 0.210600 0.035255 0.017648 -0.179137 -0.244581 -0.088591 -0.125583 0.060925 0.122514 0.130055 0.087505 0.058235 0.101733 0.096677 0.065652 0.109907 0.093525 0.154758 0.079882 0.090525 0.101281 0.128169 0.146372
qa: -0.0609 -0.0821 -0.1614 -0.4175 0.6101 -0.3363 -0.3435 -0.0865 -0.0965 -0.2788 0.2106 0.0353 0.0176 -0.1791 -0.2446 -0.0886 -0.1256 0.0609 0.1225 0.1301 0.0875 0.0582 0.1017 0.0967 0.0657 0.1099 0.0935 0.1548 0.0799 0.0905 0.1013 0.1282 0.1464
va: 1.2524 1.2176 2.3089 2.0393 5.4088 2.1204 2.1198 3.8404 3.8736 3.9394 3.7750 3.8578 3.9636 3.9439 3.8928 3.9775 3.9528 3.8670 1.0318 1.0052 1.0102 1.0233 1.0068 1.0013 1.0094 0.9904 1.0138 1.0037 1.0111 1.0055 1.0103 1.0178 1.0027
dispcorr: -0.020819210 hartree
energy: -2637.030573458698
dipole: 24.94215 -24.15584 0.78630 -10.18869 9.40380 -0.78489 2.80627 -3.12710 -0.32083
magnitude: 1.15640 au
magnitude: 2.93933 debye
