program: Orca
programVersion: 5.0.2
elementType: Cl Cl S S P O O C C C C C C C C C C C H H H H H H H H H H H H H H H
charge: 0
multiplicity: 1
keywords: wb97x-d3
keywords: def2-TZVPP
keywords: def2/J RIJCOSX
keywords: DEFGRID2
keywords: scfconv7
keywords: smallprint printgap noloewdin
keywords: NOSOSCF
formula: C11H15Cl2O2PS2
InChI: InChI=1/C11H15Cl2O2PS2/c1-3-7-18-16(17,14-4-2)15-11-6-5-9(12)8-10(11)13/h5-6,8H,3-4,7H2,1-2H3
33 atoms
Cl -1.146006 3.13859 -0.826148
Cl -5.586966 0.144754 -0.434849
S  1.47116 -1.587585 -0.98159
S  1.13331 -0.918165 2.356088
P  1.380606 -0.221186 0.588547
O  0.220183 0.771453 0.009728
O  2.629011 0.753258 0.504129
C  2.309017 -2.99827 -0.176688
C  3.786345 -2.777928 0.086672
C  4.416943 -4.023438 0.69158
C  -1.118675 0.551039 -0.06251
C  3.074166 1.41392 -0.704662
C  -1.900406 1.632488 -0.46374
C  -1.737817 -0.656026 0.228853
C  2.941084 2.906788 -0.552831
C  -3.274195 1.515607 -0.581163
C  -3.112969 -0.78357 0.115837
C  -3.871158 0.300641 -0.288183
H  2.155071 -3.82118 -0.878137
H  1.761042 -3.241006 0.734997
H  4.289309 -2.516687 -0.846847
H  3.923209 -1.933054 0.765482
H  4.322459 -4.883533 0.026218
H  5.479471 -3.868376 0.880695
H  3.947798 -4.28532 1.641646
H  4.114909 1.120322 -0.84131
H  2.51681 1.058967 -1.573879
H  -1.165621 -1.515687 0.547522
H  1.899971 3.209919 -0.445404
H  3.503625 3.275747 0.305027
H  3.339577 3.390512 -1.445463
H  -3.8646 2.365041 -0.89611
H  -3.578137 -1.732058 0.345866
elementType: Cl S P O C H
totalener: -2637.01081889 hartree
nucrepener: 2099.65833020 hartree
electener: -4736.66914908 hartree
oneelecener: -7810.95942534 hartree
twoeener: 3074.29027625 hartree
cpcmener: -0.01543238 hartree
kineticenergy: 2630.99602923 hartree
xcener: -154.150569976211 hartree
chargesum: 0.0000000
charge: -0.069157 -0.085016 -0.174420 -0.405487 0.602854 -0.306570 -0.334099 -0.078333 -0.096313 -0.263845 0.295775 0.044257 -0.031987 -0.163772 -0.244559 -0.091089 -0.156120 0.049157 0.131214 0.113860 0.070611 0.063628 0.084349 0.093735 0.084528 0.110272 0.094980 0.120804 0.079381 0.092370 0.093416 0.129122 0.146459
qa: -0.0692 -0.0850 -0.1744 -0.4055 0.6029 -0.3066 -0.3341 -0.0783 -0.0963 -0.2638 0.2958 0.0443 -0.0320 -0.1638 -0.2446 -0.0911 -0.1561 0.0492 0.1312 0.1139 0.0706 0.0636 0.0843 0.0937 0.0845 0.1103 0.0950 0.1208 0.0794 0.0924 0.0934 0.1291 0.1465
va: 1.2425 1.2162 2.2875 2.0475 5.4324 2.1717 2.1176 3.8501 3.8886 3.9536 3.7400 3.8323 3.9834 3.9593 3.9549 3.9874 4.0630 3.8961 1.0024 1.0276 1.0158 1.0259 1.0008 1.0039 1.0018 0.9922 1.0031 1.0385 1.0156 1.0054 1.0071 1.0161 1.0034
dispcorr: -0.017428680 hartree
energy: -2637.028247565183
dipole: 38.87549 -37.60885 1.26664 -16.81741 16.05493 -0.76248 -0.55105 -0.95247 -1.50352
magnitude: 2.10863 au
magnitude: 5.35971 debye
