program: Gaussian 09
title: 000066477
version: EM64L-G09RevD.01
frameworkgroup: C1[X(C16H8N4O2)]
method: RPBEPBE
basis: SDD
operation: Freq
keyword: #p
keyword: freq=noraman
keyword: PBEPBE/SDD
title: #p freq=noraman PBEPBE/SDD
converged: NO NO NO NO
title: Mulliken charges:
elementType: O O N N N N C C C C C C C C C C C C C C C C H H H H H H H H
charge: -0.287600 -0.287532 -0.645500 -0.645492 0.012870 0.012889 0.172778 0.173044 0.290012 0.289933 -0.162546 -0.162651 -0.002856 -0.002879 0.250677 0.250584 -0.378381 -0.378366 -0.225557 -0.225554 -0.301392 -0.301442 0.294729 0.294734 0.242327 0.242327 0.343362 0.397057 0.343392 0.397031
chargesum: 0.00000
title: Mulliken charges with hydrogens summed into heavy atoms:
elementType: O O N N N N C C C C C C C C C C C C C C C C
charge: -0.287600 -0.287532 0.094919 0.094931 0.012870 0.012889 0.172778 0.173044 0.290012 0.289933 -0.162546 -0.162651 -0.002856 -0.002879 0.250677 0.250584 -0.083652 -0.083632 0.016770 0.016773 -0.301392 -0.301442
polarizability: 4.35058128e+02 -3.95803256e-03 2.48766754e+02 -3.24050566e-02 -2.71396146e-03 7.60544605e+01
1716.lowfreq: -4.3730 -0.0008 -0.0004 0.0006 3.8174 3.9959 39.1231 61.2873 101.7686
frequency: 39.1217 61.2836 101.7664 104.5710 113.6408 124.3838 148.7680 155.3165 209.5464 216.4402 267.7195 298.5101 332.7187 344.0884 344.2522 362.5640 414.4371 420.9531 421.6857 432.0313 445.5843 474.1384 497.1737 498.1441 500.7647 515.6764 549.4980 552.4591 563.7611 603.1923 619.7358 678.4886 698.5251 701.0263 711.6625 741.4153 745.0803 809.3173 827.9570 841.2895 843.6162 868.4285 890.2096 932.3770 937.7004 973.8448 999.6357 1016.1067 1031.1505 1038.6383 1093.5327 1136.4072 1142.0446 1167.3879 1173.4712 1219.3905 1269.6275 1296.3074 1349.5264 1357.7276 1392.9902 1406.0496 1410.9547 1415.2179 1449.7104 1463.6048 1479.2132 1520.5423 1538.6971 1561.0244 1582.1975 1597.7108 1608.0515 1617.2643 2156.9631 2163.3144 3139.8343 3155.6738 3167.8840 3175.9471 3233.4418 3236.0266 3588.0715 3588.5831
redmass: 7.8551 9.6198 8.5566 5.2865 13.6714 10.0417 6.5246 6.4607 7.8264 5.3347 6.5271 8.9258 6.9341 4.3897 9.3510 10.9106 7.4932 5.4966 3.2963 7.4100 9.5560 4.2603 8.1755 6.6850 6.7011 9.7412 8.7345 1.1958 1.2305 7.1502 7.6067 6.7555 7.7650 5.2159 6.1013 4.9536 2.5346 1.9100 4.2396 1.1283 1.1290 7.2488 3.3693 4.4965 2.1313 8.6029 1.3879 1.3665 2.1036 5.6717 2.0809 2.0103 4.0623 1.7967 1.1032 2.3089 2.1347 4.7459 4.1962 5.5937 9.9411 3.1556 7.4430 5.8660 2.8730 3.8502 3.1156 8.2082 7.1724 2.4141 1.4432 2.9149 6.3832 6.2990 12.6201 12.6175 1.0865 1.0905 1.0946 1.1000 1.0638 1.0631 1.0894 1.0894
irintensity: 0.0010 0.0000 14.3375 0.0009 0.6609 4.6204 0.0000 0.0121 0.0501 2.1775 5.0194 2.1500 2.8692 0.0047 0.0001 0.2951 0.0000 2.1962 0.0417 37.0185 5.1844 0.0000 1.0507 0.3546 3.6990 3.3439 5.1981 0.0006 249.2217 0.0000 4.6140 5.6423 0.7838 0.0000 4.1773 1.5631 14.1344 60.4973 0.0000 0.0000 282.0491 0.7909 0.0000 84.6073 0.0000 15.0148 5.3436 0.0000 7.2080 0.5884 3.0323 9.7148 15.0568 10.9645 14.7076 1.6228 0.7807 668.0554 1.2139 293.0777 8.2609 88.5173 23.4590 12.3932 0.3540 48.7787 42.2608 367.7839 97.0075 4.9113 329.6315 43.0187 2.9802 42.5901 84.4648 1.7831 3.9351 10.2223 0.8551 30.5763 11.6900 87.0884 51.6193 114.4830
temp: 298.150 k
press: 1.00000 atm
elementType: 8 8 7 7 7 7 6 6 6 6 6 6 6 6 6 6 6 6 6 6 6 6 1 1 1 1 1 1 1 1
symmnumber: 1
zpe: 543551.9 jmol-1
zpe.correction: 0.207028 hartree
zpe.thermalcorrener: 0.224066 hartree
zpe.thermalcorrenthalpy: 0.225010 hartree
zpe.thermalcorrgfe: 0.162709 hartree
zpe.sumelectzpe: -982.522397 hartree
zpe.sumelectthermal: -982.505359 hartree
zpe.sumelectthermalent: -982.504415 hartree
zpe.sumelectthermalfe: -982.566716 hartree
dipole: -5.5366 0.0005 -0.0009
dipole: 5.5366
quadrupole: -139.4582 -123.5558 -127.6587
quadrupole: 0.0043 -0.0029 0.0045
quadrupole: -9.2340 6.6684 2.5655 0.0043 -0.0029 0.0045
hfenergy: -982.7294251 hartree
pointgroup: C01 [X(C16H8N4O2)]
dipole: -2.1782621 -0.0001697 0.0003619 debye
polarizability: 435.0581281|0.0026086|248.7667535|0.032405|-0.0027142|76.0544605 unknown
InChI: InChI=1S/C16H8N4O2/c17-5-9-10(6-18)14(20)12-11(13(9)19)15(21)7-3-1-2-4-8(7)16(12)22/h1-4H,19-20H2
charge 0 multiplicity 1
30 atoms
O  -1.251689 2.763446 -0.000089
O  -1.252021 -2.763515 -0.000227
N  1.322253 2.822521 0.000407
N  1.322498 -2.822621 0.00017
N  4.759262 2.100482 -0.000287
N  4.759467 -2.100281 0.000711
C  0.048723 0.719444 0.000154
C  0.048711 -0.719614 0.000104
C  -2.497043 0.71175 -0.000181
C  -2.497084 -0.711725 -0.000227
C  -1.223349 1.469178 0.00003
C  -1.223444 -1.469251 -0.000045
C  1.291896 1.454129 0.000274
C  1.291964 -1.454247 0.000146
C  2.529813 0.706273 0.000336
C  2.529847 -0.706316 0.000247
C  -3.728838 1.415862 -0.00034
C  -3.728919 -1.415766 -0.000438
C  -4.945929 0.710208 -0.000563
C  -4.945968 -0.710043 -0.000615
C  3.76125 1.438161 0.00039
C  3.761293 -1.4382 0.000247
H  -3.696893 2.509363 -0.0003
H  -3.697038 -2.509269 -0.000474
H  -5.89508 1.256204 -0.000693
H  -5.895152 -1.255984 -0.000784
H  2.209417 3.326099 0.000495
H  0.399813 3.297037 0.000551
H  2.209737 -3.326076 0.000247
H  0.400103 -3.297246 0.000155
