program: Orca
programVersion: 5.0.2
elementType: Cl Cl S S P O O C C C C C C C C C C C H H H H H H H H H H H H H H H
charge: 0
multiplicity: 1
keywords: wb97x-d3
keywords: def2-TZVPP
keywords: def2/J RIJCOSX
keywords: DEFGRID2
keywords: scfconv7
keywords: smallprint printgap noloewdin
keywords: NOSOSCF
formula: C11H15Cl2O2PS2
InChI: InChI=1/C11H15Cl2O2PS2/c1-3-7-18-16(17,14-4-2)15-11-6-5-9(12)8-10(11)13/h5-6,8H,3-4,7H2,1-2H3
33 atoms
Cl -0.90952 2.635595 -0.314721
Cl -5.406367 -0.247954 0.208647
S  2.887632 -1.30561 -0.458612
S  1.020458 0.283052 1.909847
P  1.543457 0.185898 0.065865
O  0.313643 0.016187 -0.998546
O  2.212632 1.453829 -0.629908
C  2.595892 -2.574965 0.824691
C  1.29864 -3.34861 0.687194
C  1.146464 -4.088863 -0.629567
C  -1.003288 -0.040233 -0.652624
C  3.309038 2.173602 -0.03515
C  -1.712494 1.113605 -0.33394
C  -1.662286 -1.25783 -0.689028
C  3.308406 3.572016 -0.597309
C  -3.069649 1.055573 -0.062835
C  -3.019101 -1.331446 -0.424702
C  -3.709797 -0.171848 -0.112152
H  2.669831 -2.087071 1.796733
H  3.458183 -3.237831 0.726633
H  1.277527 -4.064403 1.5140
H  0.451618 -2.678571 0.851046
H  1.967053 -4.792031 -0.786075
H  0.217703 -4.660275 -0.647187
H  1.129125 -3.406866 -1.480839
H  3.195677 2.193032 1.05135
H  4.240482 1.653844 -0.268544
H  -1.110152 -2.15253 -0.94624
H  4.14452 4.12918 -0.174274
H  3.422693 3.569665 -1.681572
H  2.389977 4.102096 -0.343886
H  -3.614307 1.957736 0.179998
H  -3.526701 -2.28518 -0.464069
elementType: Cl S P O C H
totalener: -2637.01029416 hartree
nucrepener: 2148.88242066 hartree
electener: -4785.89271482 hartree
oneelecener: -7910.06819382 hartree
twoeener: 3124.17547900 hartree
cpcmener: -0.01595194 hartree
kineticenergy: 2631.01901815 hartree
xcener: -154.154111502331 hartree
chargesum: 0.0000000
charge: -0.062470 -0.082776 -0.163515 -0.410175 0.615285 -0.345117 -0.330844 -0.108904 -0.090915 -0.279753 0.175113 0.033954 0.057119 -0.131223 -0.240543 -0.124858 -0.178787 0.093622 0.125775 0.129747 0.086465 0.047551 0.098706 0.098372 0.074253 0.091942 0.100371 0.183188 0.090409 0.090411 0.084561 0.129873 0.143161
qa: -0.0625 -0.0828 -0.1635 -0.4102 0.6153 -0.3451 -0.3308 -0.1089 -0.0909 -0.2798 0.1751 0.0340 0.0571 -0.1312 -0.2405 -0.1249 -0.1788 0.0936 0.1258 0.1297 0.0865 0.0476 0.0987 0.0984 0.0743 0.0919 0.1004 0.1832 0.0904 0.0904 0.0846 0.1299 0.1432
va: 1.2559 1.2180 2.3154 2.0287 5.4053 2.1040 2.1237 3.8646 3.8573 3.9349 3.8278 3.8535 3.9593 3.9174 3.9632 4.0392 4.0603 3.8594 1.0287 1.0038 1.0093 1.0277 1.0032 1.0021 1.0109 1.0026 0.9963 0.9653 1.0074 1.0030 1.0058 1.0168 1.0067
dispcorr: -0.018446600 hartree
energy: -2637.028740758651
dipole: 26.69123 -25.65030 1.04093 -14.66840 13.64763 -1.02078 -0.42432 0.26043 -0.16389
magnitude: 1.46710 au
magnitude: 3.72907 debye
