program: Orca
programVersion: 5.0.2
elementType: Cl Cl S S P O O C C C C C C C C C C C H H H H H H H H H H H H H H H
charge: 0
multiplicity: 1
keywords: wb97x-d3
keywords: def2-TZVPP
keywords: def2/J RIJCOSX
keywords: DEFGRID2
keywords: scfconv7
keywords: smallprint printgap noloewdin
keywords: NOSOSCF
formula: C11H15Cl2O2PS2
InChI: InChI=1/C11H15Cl2O2PS2/c1-3-7-18-16(17,14-4-2)15-11-6-5-9(12)8-10(11)13/h5-6,8H,3-4,7H2,1-2H3
33 atoms
Cl -0.881768 2.791336 0.772551
Cl -5.222368 -0.299026 0.1128
S  2.061634 -1.603482 -1.157439
S  1.372617 -0.126036 1.858131
P  1.685142 0.088394 -0.023786
O  0.450441 0.757705 -0.870218
O  2.866983 1.054952 -0.469515
C  2.848296 -2.724706 0.062088
C  1.858469 -3.67787 0.702969
C  2.555161 -4.606576 1.686494
C  -0.858948 0.475568 -0.610684
C  3.056235 2.374438 0.093936
C  -1.614388 1.366568 0.143911
C  -1.460319 -0.655236 -1.138365
C  2.672999 3.435807 -0.90458
C  -2.961153 1.134218 0.369352
C  -2.804665 -0.901915 -0.91905
C  -3.541595 -0.005258 -0.163115
H  3.37806 -2.126704 0.803791
H  3.603178 -3.264765 -0.511905
H  1.082779 -3.105492 1.214805
H  1.362371 -4.263201 -0.074485
H  3.025445 -4.047237 2.497197
H  1.844837 -5.301399 2.135522
H  3.331272 -5.199263 1.198707
H  2.491335 2.47532 1.022473
H  4.114088 2.437104 0.345289
H  -0.879855 -1.342966 -1.73881
H  2.90343 4.416035 -0.485613
H  3.233957 3.331446 -1.832995
H  1.609174 3.414348 -1.135901
H  -3.543414 1.834821 0.95167
H  -3.265564 -1.784897 -1.339227
elementType: Cl S P O C H
totalener: -2637.01052904 hartree
nucrepener: 2126.26984227 hartree
electener: -4763.28037131 hartree
oneelecener: -7864.82676858 hartree
twoeener: 3101.54639726 hartree
cpcmener: -0.01424695 hartree
kineticenergy: 2631.02038352 hartree
xcener: -154.150599558780 hartree
chargesum: -0.0000000
charge: -0.061336 -0.082001 -0.154139 -0.412935 0.617657 -0.357065 -0.336088 -0.075394 -0.100028 -0.262994 0.228791 0.043286 0.018612 -0.176886 -0.231149 -0.094340 -0.126972 0.056730 0.106329 0.128560 0.062869 0.070611 0.083306 0.093444 0.083564 0.081398 0.111884 0.153710 0.095295 0.092002 0.067501 0.129199 0.146577
qa: -0.0613 -0.0820 -0.1541 -0.4129 0.6177 -0.3571 -0.3361 -0.0754 -0.1000 -0.2630 0.2288 0.0433 0.0186 -0.1769 -0.2311 -0.0943 -0.1270 0.0567 0.1063 0.1286 0.0629 0.0706 0.0833 0.0934 0.0836 0.0814 0.1119 0.1537 0.0953 0.0920 0.0675 0.1292 0.1466
va: 1.2483 1.2187 2.3071 2.0303 5.4106 2.0905 2.1174 3.8252 3.8938 3.9503 3.7825 3.8435 3.9944 4.0281 3.9398 3.9961 4.0175 3.8861 1.0301 1.0090 1.0278 1.0133 1.0023 1.0042 1.0015 1.0159 0.9937 1.0041 1.0072 1.0060 1.0235 1.0150 1.0022
dispcorr: -0.017773281 hartree
energy: -2637.028302323168
dipole: 28.80644 -27.96266 0.84379 -15.29863 14.81330 -0.48533 0.84760 -1.45983 -0.61223
magnitude: 1.14994 au
magnitude: 2.92290 debye
