program: Orca
programVersion: 5.0.2
elementType: Cl Cl S S P O O C C C C C C C C C C C H H H H H H H H H H H H H H H
charge: 0
multiplicity: 1
keywords: wb97x-d3
keywords: def2-TZVPP
keywords: def2/J RIJCOSX
keywords: DEFGRID2
keywords: scfconv7
keywords: smallprint printgap noloewdin
keywords: NOSOSCF
formula: C11H15Cl2O2PS2
InChI: InChI=1/C11H15Cl2O2PS2/c1-3-7-18-16(17,14-4-2)15-11-6-5-9(12)8-10(11)13/h5-6,8H,3-4,7H2,1-2H3
33 atoms
Cl -1.508085 -1.319005 1.893417
Cl -5.104726 0.379455 -1.711557
S  1.325398 -0.955298 -1.02304
S  2.887989 0.499581 1.656926
P  1.547042 0.642751 0.295043
O  0.086054 0.920508 0.953307
O  1.619328 1.890895 -0.700255
C  2.340461 -2.264299 -0.251727
C  1.663843 -2.998771 0.887523
C  2.563749 -4.0984 1.430179
C  -1.100201 0.801272 0.28306
C  2.785311 2.143142 -1.515858
C  -1.96618 -0.223771 0.649954
C  -1.487714 1.704157 -0.694519
C  3.706632 3.140503 -0.861293
C  -3.20277 -0.35861 0.041134
C  -2.720386 1.579012 -1.31361
C  -3.56443 0.545316 -0.943813
H  3.287291 -1.820118 0.056344
H  2.554677 -2.940522 -1.082144
H  1.423466 -2.294433 1.685269
H  0.71909 -3.421807 0.540743
H  2.070508 -4.639799 2.238154
H  2.822016 -4.825208 0.657693
H  3.495248 -3.691591 1.827876
H  3.30599 1.207241 -1.734173
H  2.396352 2.526991 -2.457907
H  -0.839806 2.525391 -0.966338
H  4.510376 3.387757 -1.556406
H  3.184633 4.06531 -0.613829
H  4.159551 2.741271 0.045601
H  -3.868261 -1.159339 0.332959
H  -3.011562 2.290783 -2.073472
elementType: Cl S P O C H
totalener: -2637.01027576 hartree
nucrepener: 2136.73307476 hartree
electener: -4773.74335053 hartree
oneelecener: -7885.51760975 hartree
twoeener: 3111.77425922 hartree
cpcmener: -0.01518412 hartree
kineticenergy: 2631.01715822 hartree
xcener: -154.152480081307 hartree
chargesum: 0.0000000
charge: -0.060743 -0.081512 -0.171515 -0.406793 0.617938 -0.329197 -0.338992 -0.065421 -0.090602 -0.262959 0.131489 0.042274 0.035586 -0.115070 -0.240844 -0.105262 -0.142845 0.071174 0.110011 0.130610 0.047369 0.066329 0.092987 0.083994 0.083022 0.089087 0.108379 0.163569 0.094456 0.089081 0.077239 0.130159 0.147001
qa: -0.0607 -0.0815 -0.1715 -0.4068 0.6179 -0.3292 -0.3390 -0.0654 -0.0906 -0.2630 0.1315 0.0423 0.0356 -0.1151 -0.2408 -0.1053 -0.1428 0.0712 0.1100 0.1306 0.0474 0.0663 0.0930 0.0840 0.0830 0.0891 0.1084 0.1636 0.0945 0.0891 0.0772 0.1302 0.1470
va: 1.2506 1.2190 2.2994 2.0482 5.4077 2.1324 2.1036 3.8265 3.8870 3.9602 3.8722 3.8526 3.9500 3.9519 3.9385 4.0259 4.0039 3.8766 1.0311 1.0037 1.0310 1.0172 1.0038 1.0016 1.0024 1.0065 0.9926 1.0041 1.0079 1.0038 1.0211 1.0165 1.0022
dispcorr: -0.018170782 hartree
energy: -2637.028446543108
dipole: 32.27492 -31.77609 0.49883 -5.25111 5.17554 -0.07557 -3.71347 1.94213 -1.77134
magnitude: 1.84179 au
magnitude: 4.68146 debye
