program: Orca
programVersion: 5.0.2
elementType: Cl Cl S S P O O C C C C C C C C C C C H H H H H H H H H H H H H H H
charge: 0
multiplicity: 1
keywords: wb97x-d3
keywords: def2-TZVPP
keywords: def2/J RIJCOSX
keywords: DEFGRID2
keywords: scfconv7
keywords: smallprint printgap noloewdin
keywords: NOSOSCF
formula: C11H15Cl2O2PS2
InChI: InChI=1/C11H15Cl2O2PS2/c1-3-7-18-16(17,14-4-2)15-11-6-5-9(12)8-10(11)13/h5-6,8H,3-4,7H2,1-2H3
33 atoms
Cl -1.709342 -0.007792 2.559659
Cl -4.761477 -0.865663 -1.771303
S  1.85553 -0.989803 -0.827479
S  2.94975 1.033715 1.7001
P  1.763139 0.807751 0.210805
O  0.214646 1.020176 0.677119
O  1.849938 1.881362 -0.968419
C  2.217791 -2.173611 0.521209
C  1.057662 -2.451168 1.457429
C  -0.159066 -3.056354 0.780417
C  -0.914207 0.588642 0.051408
C  3.081407 2.521344 -1.365679
C  -1.930392 0.076875 0.854116
C  -1.110191 0.665469 -1.319679
C  3.982932 1.615572 -2.165356
C  -3.120293 -0.365193 0.30181
C  -2.291719 0.216297 -1.885839
C  -3.285426 -0.299112 -1.071438
H  3.092978 -1.807738 1.058082
H  2.517105 -3.078985 -0.011378
H  1.431971 -3.14048 2.219957
H  0.786061 -1.538568 1.991437
H  -0.955679 -3.235483 1.502953
H  -0.562483 -2.405682 0.003266
H  0.084377 -4.013524 0.314939
H  2.762923 3.376031 -1.96023
H  3.590138 2.899943 -0.477181
H  -0.351662 1.086306 -1.965087
H  3.471037 1.199728 -3.033432
H  4.829466 2.200906 -2.526925
H  4.381905 0.795611 -1.568399
H  -3.89933 -0.761612 0.93835
H  -2.427267 0.277081 -2.956663
elementType: Cl S P O C H
totalener: -2637.00992260 hartree
nucrepener: 2171.49875052 hartree
electener: -4808.50867312 hartree
oneelecener: -7954.80019605 hartree
twoeener: 3146.29152292 hartree
cpcmener: -0.01524368 hartree
kineticenergy: 2631.00542803 hartree
xcener: -154.155380417611 hartree
chargesum: 0.0000000
charge: -0.067371 -0.083554 -0.158882 -0.412924 0.613991 -0.322744 -0.333868 -0.101536 -0.092447 -0.261112 0.205779 0.021845 0.008717 -0.161389 -0.241958 -0.091594 -0.144543 0.064030 0.129795 0.127680 0.088394 0.043152 0.094099 0.062743 0.101362 0.107750 0.098321 0.158251 0.091125 0.102558 0.081117 0.127177 0.146037
qa: -0.0674 -0.0836 -0.1589 -0.4129 0.6140 -0.3227 -0.3339 -0.1015 -0.0924 -0.2611 0.2058 0.0218 0.0087 -0.1614 -0.2420 -0.0916 -0.1445 0.0640 0.1298 0.1277 0.0884 0.0432 0.0941 0.0627 0.1014 0.1078 0.0983 0.1583 0.0911 0.1026 0.0811 0.1272 0.1460
va: 1.2431 1.2175 2.2944 2.0537 5.4020 2.1400 2.1118 3.8699 3.8512 3.9314 3.8448 3.8615 3.9065 3.9177 3.8896 3.9978 4.0298 3.8835 1.0256 1.0043 1.0118 1.0410 1.0063 1.0076 1.0063 0.9908 1.0114 1.0132 1.0033 1.0109 1.0150 1.0181 1.0036
dispcorr: -0.020397758 hartree
energy: -2637.030320359702
dipole: 24.54783 -23.99573 0.55210 -7.20228 6.66345 -0.53883 -7.50192 5.90350 -1.59842
magnitude: 1.77485 au
magnitude: 4.51131 debye
