program: Orca
programVersion: 5.0.2
elementType: Cl Cl S S P O O C C C C C C C C C C C H H H H H H H H H H H H H H H
charge: 0
multiplicity: 1
keywords: wb97x-d3
keywords: def2-TZVPP
keywords: def2/J RIJCOSX
keywords: DEFGRID2
keywords: scfconv7
keywords: smallprint printgap noloewdin
keywords: NOSOSCF
formula: C11H15Cl2O2PS2
InChI: InChI=1/C11H15Cl2O2PS2/c1-3-7-18-16(17,14-4-2)15-11-6-5-9(12)8-10(11)13/h5-6,8H,3-4,7H2,1-2H3
33 atoms
Cl -0.570166 0.911786 -2.548267
Cl -4.993729 1.591377 0.418479
S  3.160317 -1.065935 -0.593527
S  1.58116 -0.388988 2.36042
P  1.611992 -0.180275 0.447888
O  0.304727 -0.797642 -0.332302
O  1.672209 1.302568 -0.128772
C  3.419596 -2.603158 0.365635
C  2.321741 -3.642041 0.234597
C  2.049484 -4.088192 -1.190944
C  -0.931266 -0.242693 -0.137782
C  1.737707 2.491971 0.687547
C  -1.462516 0.59638 -1.111834
C  -1.67332 -0.529297 0.996957
C  0.361563 3.008349 1.02026
C  -2.716542 1.162516 -0.947987
C  -2.928014 0.029449 1.173765
C  -3.432703 0.879457 0.203332
H  3.589101 -2.323117 1.405398
H  4.364572 -2.984401 -0.026765
H  2.637526 -4.500218 0.834775
H  1.40407 -3.274999 0.699789
H  1.654608 -3.275831 -1.802112
H  2.957305 -4.455883 -1.673261
H  1.316725 -4.8955 -1.208404
H  2.313905 2.289745 1.591998
H  2.294576 3.212547 0.090266
H  -1.273897 -1.202168 1.743105
H  0.460703 3.935712 1.586607
H  -0.214142 3.227855 0.121043
H  -0.199524 2.303289 1.634828
H  -3.121129 1.816652 -1.708182
H  -3.499308 -0.199721 2.062582
elementType: Cl S P O C H
totalener: -2637.01023785 hartree
nucrepener: 2164.44247451 hartree
electener: -4801.45271236 hartree
oneelecener: -7941.01714502 hartree
twoeener: 3139.56443265 hartree
cpcmener: -0.01379821 hartree
kineticenergy: 2631.01437006 hartree
xcener: -154.151855305152 hartree
chargesum: -0.0000000
charge: -0.063927 -0.082248 -0.147156 -0.420354 0.622418 -0.342403 -0.348333 -0.120182 -0.096698 -0.255187 0.279284 0.041688 -0.024654 -0.195473 -0.245884 -0.092912 -0.124126 0.061037 0.127569 0.130134 0.084824 0.055802 0.071905 0.086067 0.093892 0.092232 0.109754 0.149169 0.108496 0.089975 0.078958 0.129477 0.146856
qa: -0.0639 -0.0822 -0.1472 -0.4204 0.6224 -0.3424 -0.3483 -0.1202 -0.0967 -0.2552 0.2793 0.0417 -0.0247 -0.1955 -0.2459 -0.0929 -0.1241 0.0610 0.1276 0.1301 0.0848 0.0558 0.0719 0.0861 0.0939 0.0922 0.1098 0.1492 0.1085 0.0900 0.0790 0.1295 0.1469
va: 1.2453 1.2181 2.3174 2.0236 5.3814 2.0693 2.1193 3.8823 3.8607 3.9353 3.7412 3.8465 3.9921 4.0122 3.9122 3.9864 3.9939 3.8807 1.0270 1.0019 1.0075 1.0258 1.0159 1.0009 1.0048 1.0139 0.9925 1.0063 1.0121 1.0042 1.0104 1.0162 1.0024
dispcorr: -0.019575446 hartree
energy: -2637.029813300471
dipole: 19.33209 -19.01955 0.31254 -12.80359 12.68768 -0.11591 7.16156 -6.86376 0.29780
magnitude: 0.44699 au
magnitude: 1.13615 debye
