program: Orca
programVersion: 5.0.2
elementType: Cl Cl S S P O O C C C C C C C C C C C H H H H H H H H H H H H H H H
charge: 0
multiplicity: 1
keywords: wb97x-d3
keywords: def2-TZVPP
keywords: def2/J RIJCOSX
keywords: DEFGRID2
keywords: scfconv7
keywords: smallprint printgap noloewdin
keywords: NOSOSCF
formula: C11H15Cl2O2PS2
InChI: InChI=1/C11H15Cl2O2PS2/c1-3-7-18-16(17,14-4-2)15-11-6-5-9(12)8-10(11)13/h5-6,8H,3-4,7H2,1-2H3
33 atoms
Cl -0.579488 1.791457 -2.063006
Cl -5.21226 -0.400918 -0.453067
S  1.56818 -0.836605 -0.964766
S  1.698013 -0.813212 2.45337
P  1.611053 0.209603 0.832629
O  0.312722 1.185909 0.633703
O  2.761835 1.301812 0.782896
C  2.530587 -2.339813 -0.542751
C  1.647801 -3.501086 -0.127898
C  2.488532 -4.720482 0.223748
C  -0.958406 0.755711 0.394334
C  3.016374 2.183447 -0.332194
C  -1.522112 1.011495 -0.851244
C  -1.714701 0.136551 1.375798
C  2.549576 3.58502 -0.029954
C  -2.833687 0.660126 -1.120068
C  -3.026868 -0.224918 1.119275
C  -3.573107 0.038943 -0.126411
H  3.262338 -2.090222 0.225616
H  3.087457 -2.571556 -1.452139
H  1.039958 -3.208149 0.729385
H  0.958801 -3.742937 -0.94049
H  3.154539 -4.51366 1.063513
H  1.855396 -5.562728 0.504547
H  3.105066 -5.039112 -0.618873
H  4.095001 2.155887 -0.483056
H  2.551986 1.801115 -1.243526
H  -1.284682 -0.047929 2.351196
H  2.85746 4.239963 -0.845595
H  1.465712 3.648422 0.056343
H  2.997309 3.966038 0.888199
H  -3.26536 0.86781 -2.089543
H  -3.614357 -0.702044 1.891344
elementType: Cl S P O C H
totalener: -2637.01002869 hartree
nucrepener: 2138.50016246 hartree
electener: -4775.51019115 hartree
oneelecener: -7888.90333770 hartree
twoeener: 3113.39314656 hartree
cpcmener: -0.01476067 hartree
kineticenergy: 2631.00811539 hartree
xcener: -154.150893184706 hartree
chargesum: 0.0000000
charge: -0.063839 -0.081606 -0.183172 -0.410931 0.612836 -0.340761 -0.330617 -0.063769 -0.095427 -0.267926 0.226035 0.035552 0.008709 -0.184335 -0.234440 -0.086200 -0.119352 0.050435 0.107151 0.129587 0.062591 0.072433 0.083304 0.093686 0.083923 0.112698 0.088131 0.153891 0.094909 0.074896 0.091300 0.132632 0.147675
qa: -0.0638 -0.0816 -0.1832 -0.4109 0.6128 -0.3408 -0.3306 -0.0638 -0.0954 -0.2679 0.2260 0.0356 0.0087 -0.1843 -0.2344 -0.0862 -0.1194 0.0504 0.1072 0.1296 0.0626 0.0724 0.0833 0.0937 0.0839 0.1127 0.0881 0.1539 0.0949 0.0749 0.0913 0.1326 0.1477
va: 1.2479 1.2190 2.3105 2.0416 5.4265 2.0961 2.1284 3.8393 3.8889 3.9549 3.7770 3.8492 3.9750 4.0411 3.9261 3.9829 4.0086 3.8922 1.0304 1.0071 1.0282 1.0136 1.0023 1.0044 1.0011 0.9962 1.0090 1.0063 1.0068 1.0192 1.0060 1.0131 1.0014
dispcorr: -0.017868632 hartree
energy: -2637.027897320386
dipole: 27.04947 -26.52269 0.52679 -12.18567 12.13679 -0.04888 2.43934 -3.68344 -1.24410
magnitude: 1.35192 au
magnitude: 3.43630 debye
