program: Gaussian 09
title: 000066483
version: EM64L-G09RevD.01
frameworkgroup: C1[X(C14H6Br4N2O2)]
method: RPBEPBE
basis: SDD
operation: Freq
keyword: #p
keyword: freq=noraman
keyword: PBEPBE/SDD
title: #p freq=noraman PBEPBE/SDD
converged: NO YES NO NO
title: Mulliken charges:
elementType: Br Br Br Br O O N N C C C C C C C C C C C C C C H H H H H H
charge: 0.073935 0.073931 0.045736 0.045734 -0.284031 -0.284027 -0.658780 -0.658778 0.102362 0.102385 0.472387 0.472384 -0.114158 -0.114167 0.486872 0.486863 -0.450239 -0.450231 -0.508850 -0.508845 -0.159233 -0.159216 0.279727 0.279727 0.396190 0.318064 0.318064 0.396191
chargesum: 0.00000
title: Mulliken charges with hydrogens summed into heavy atoms:
elementType: Br Br Br Br O O N N C C C C C C C C C C C C C C
charge: 0.073935 0.073931 0.045736 0.045734 -0.284031 -0.284027 0.055474 0.055478 0.102362 0.102385 0.472387 0.472384 -0.114158 -0.114167 0.486872 0.486863 -0.450239 -0.450231 -0.508850 -0.508845 0.120494 0.120511
polarizability: 4.88022012e+02 -1.40382786e+01 3.33840509e+02 -2.08227223e-02 2.95720643e-02 7.96870189e+01
1716.lowfreq: -12.0075 -5.3349 -1.7009 -1.4654 -0.0006 -0.0005 -0.0001 17.5006 41.2150
frequency: -12.0075 17.5006 41.2007 87.1696 94.9701 104.0129 110.6525 112.2846 137.8084 140.4449 149.8294 183.0611 211.9248 236.9571 261.9981 269.3539 287.4345 337.7441 345.2300 361.9301 364.5357 415.3035 434.6865 442.2636 445.8385 476.5856 483.3329 488.2901 553.6448 563.1845 563.5023 595.1707 606.4521 609.8823 664.2301 690.4148 711.8341 731.3843 750.4945 759.4082 767.8843 855.7441 857.8922 859.9093 886.2126 893.6348 893.9495 898.7477 979.3258 1032.0273 1085.9117 1092.5349 1147.4603 1187.2537 1253.6564 1275.2538 1302.2352 1341.9307 1361.4726 1378.7947 1386.1405 1391.2256 1413.0988 1415.0079 1484.1919 1504.4073 1510.1220 1532.7443 1559.3115 1570.8799 1592.9087 1603.6515 3179.0995 3179.1044 3265.5288 3267.0120 3591.0382 3591.1186
redmass: 13.1625 47.6539 10.6935 33.4921 11.0547 9.0387 71.4515 7.1607 6.7000 33.9740 39.7362 34.5547 6.4691 11.6176 18.6750 9.2107 5.1658 9.8614 9.1634 6.4698 4.7851 9.9120 10.3024 6.5806 6.6314 8.8143 6.3290 3.8270 1.5009 4.9464 1.3769 3.2158 5.5315 3.5076 8.8697 8.6063 8.6004 9.7674 8.3849 7.9449 7.7138 1.7471 2.4228 1.1466 6.8145 1.3818 1.3788 10.1522 5.4547 2.6935 3.7500 1.8780 4.2906 2.4375 4.6012 1.6422 2.2585 7.8154 5.4426 4.9365 8.4126 6.5778 3.3603 2.7437 8.6150 4.8486 6.2300 7.2886 2.3325 1.7190 3.7867 7.2817 1.0932 1.0932 1.0619 1.0618 1.0899 1.0898
irintensity: 0.3319 0.3071 0.0000 0.0340 0.0000 4.3001 0.0002 0.4440 0.0001 0.4255 0.0000 0.0000 0.7470 1.1564 14.1199 0.0000 0.0000 0.0000 5.0480 0.9180 0.0000 0.0000 0.0000 6.4994 0.0008 0.0000 30.2568 2.5761 194.2101 0.0012 0.0003 0.0002 15.2290 59.7381 0.0000 118.1756 0.0001 0.0002 8.3450 85.6276 0.2410 0.0004 0.0011 292.2421 0.0105 11.1569 0.0002 11.7371 0.0000 95.2326 339.6746 0.0004 0.0003 1.4143 782.2375 0.0002 12.0694 0.0000 213.1882 0.0002 0.0000 126.5205 36.7214 0.0004 0.0003 699.7911 0.0002 28.2808 9.0534 0.0001 327.5494 0.0001 0.3384 0.2237 0.0003 127.1845 234.6722 0.8805
temp: 298.150 k
press: 1.00000 atm
elementType: 35 35 35 35 8 8 7 7 6 6 6 6 6 6 6 6 6 6 6 6 6 6 1 1 1 1 1 1
symmnumber: 1
zpe: 443996.2 jmol-1
zpe.correction: 0.169109 hartree
zpe.thermalcorrener: 0.188033 hartree
zpe.thermalcorrenthalpy: 0.188977 hartree
zpe.thermalcorrgfe: 0.118886 hartree
zpe.sumelectzpe: -849.401787 hartree
zpe.sumelectthermal: -849.382863 hartree
zpe.sumelectthermalent: -849.381919 hartree
zpe.sumelectthermalfe: -849.452010 hartree
dipole: 0.0000 0.0000 -0.0075
dipole: 0.0075
quadrupole: -144.9087 -160.4082 -166.7462
quadrupole: -13.3911 -0.0001 -0.0034
quadrupole: 12.4457 -3.0539 -9.3918 -13.3911 -0.0001 -0.0034
hfenergy: -849.5708959 hartree
pointgroup: C01 [X(C14H6Br4N2O2)]
dipole: 0.00002 0.0000155 0.0029372 debye
polarizability: 489.2882155|0.49481|332.5743053|0.0233109|0.0276531|79.6870189 unknown
InChI: InChI=1S/C14H6Br4N2O2/c15-3-1-5(17)11(19)9-7(3)13(21)10-8(14(9)22)4(16)2-6(18)12(10)20/h1-2H,19-20H2
charge 0 multiplicity 1
28 atoms
Br -2.316774 3.70061 0.001534
Br 2.316879 -3.700632 0.001079
Br -5.637268 -0.886677 0.0012
Br 5.637242 0.886702 0.001678
O  0.393192 2.721507 -0.002044
O  -0.39326 -2.721535 -0.002885
N  -2.919024 -2.449964 -0.000784
N  2.918984 2.449948 -0.000142
C  -1.369247 -0.526271 -0.000859
C  1.369227 0.52624 -0.000608
C  -1.176984 0.901924 -0.000458
C  1.176975 -0.901962 -0.000555
C  0.21334 1.446612 -0.001259
C  -0.213367 -1.446646 -0.001788
C  -2.704123 -1.101003 -0.000505
C  2.704096 1.100991 -0.000059
C  -2.318725 1.744109 0.0005
C  2.318736 -1.744134 0.000358
C  -3.808537 -0.183521 0.000419
C  3.80852 0.183521 0.000757
C  -3.627036 1.194518 0.000954
C  3.627036 -1.194517 0.001023
H  -4.492803 1.860694 0.001748
H  4.492811 -1.860681 0.001737
H  -2.073241 -3.046642 -0.000484
H  -3.871452 -2.813657 -0.000303
H  3.871408 2.813648 0.00042
H  2.073193 3.046616 -0.000174
