program: Orca
programVersion: 5.0.2
elementType: Cl Cl S S P O O C C C C C C C C C C C H H H H H H H H H H H H H H H
charge: 0
multiplicity: 1
keywords: wb97x-d3
keywords: def2-TZVPP
keywords: def2/J RIJCOSX
keywords: DEFGRID2
keywords: scfconv7
keywords: smallprint printgap noloewdin
keywords: NOSOSCF
formula: C11H15Cl2O2PS2
InChI: InChI=1/C11H15Cl2O2PS2/c1-3-7-18-16(17,14-4-2)15-11-6-5-9(12)8-10(11)13/h5-6,8H,3-4,7H2,1-2H3
33 atoms
Cl -1.084749 2.83531 -1.41366
Cl -5.561981 0.417374 0.299389
S  1.464747 -2.156477 -0.719451
S  1.208596 -0.29932 2.152525
P  1.414275 -0.323018 0.243748
O  0.224694 0.406087 -0.608779
O  2.676358 0.435562 -0.361274
C  2.363341 -3.175007 0.508287
C  3.837031 -2.848596 0.660129
C  4.646223 -3.011178 -0.613738
C  -1.108743 0.358862 -0.345139
C  3.293656 1.573262 0.283623
C  -1.863497 1.47266 -0.705143
C  -1.747295 -0.734726 0.221181
C  2.467451 2.828888 0.168569
C  -3.234559 1.495782 -0.514667
C  -3.117276 -0.719826 0.424989
C  -3.85029 0.394763 0.05611
H  2.224582 -4.193833 0.141376
H  1.83291 -3.096754 1.456691
H  3.957059 -1.839402 1.060714
H  4.224503 -3.523138 1.429203
H  5.701413 -2.80838 -0.42896
H  4.568795 -4.027019 -1.00546
H  4.313177 -2.326554 -1.394542
H  3.497387 1.325788 1.327098
H  4.248211 1.685986 -0.227606
H  -1.191541 -1.620255 0.496319
H  1.5389 2.765975 0.735488
H  3.043443 3.661126 0.574984
H  2.231751 3.061154 -0.869363
H  -3.807039 2.365534 -0.805891
H  -3.599125 -1.58093 0.866352
elementType: Cl S P O C H
totalener: -2637.01074726 hartree
nucrepener: 2117.17282372 hartree
electener: -4754.18357097 hartree
oneelecener: -7846.40661858 hartree
twoeener: 3092.22304761 hartree
cpcmener: -0.01405157 hartree
kineticenergy: 2631.01727451 hartree
xcener: -154.154724522634 hartree
chargesum: -0.0000000
charge: -0.067172 -0.084868 -0.157087 -0.413666 0.624907 -0.330299 -0.338492 -0.111237 -0.089942 -0.255205 0.265084 0.040792 -0.004756 -0.163618 -0.240365 -0.093547 -0.152012 0.055762 0.130501 0.126419 0.054073 0.083034 0.093794 0.084916 0.073649 0.094882 0.111079 0.126952 0.074633 0.101115 0.087361 0.127509 0.145802
qa: -0.0672 -0.0849 -0.1571 -0.4137 0.6249 -0.3303 -0.3385 -0.1112 -0.0899 -0.2552 0.2651 0.0408 -0.0048 -0.1636 -0.2404 -0.0935 -0.1520 0.0558 0.1305 0.1264 0.0541 0.0830 0.0938 0.0849 0.0736 0.0949 0.1111 0.1270 0.0746 0.1011 0.0874 0.1275 0.1458
va: 1.2450 1.2163 2.2940 2.0246 5.3831 2.1506 2.1062 3.8768 3.8789 3.9390 3.7714 3.8395 3.9677 3.9588 3.9073 4.0006 4.0495 3.8897 1.0026 1.0273 1.0234 1.0073 1.0047 1.0015 1.0139 1.0099 0.9905 1.0330 1.0207 1.0105 1.0078 1.0171 1.0033
dispcorr: -0.018103913 hartree
energy: -2637.028851169428
dipole: 38.57542 -37.23807 1.33735 -13.55938 12.81904 -0.74034 4.26216 -4.20721 0.05495
magnitude: 1.52958 au
magnitude: 3.88789 debye
