program: Orca
programVersion: 5.0.2
elementType: Cl Cl S S P O O C C C C C C C C C C C H H H H H H H H H H H H H H H
charge: 0
multiplicity: 1
keywords: wb97x-d3
keywords: def2-TZVPP
keywords: def2/J RIJCOSX
keywords: DEFGRID2
keywords: scfconv7
keywords: smallprint printgap noloewdin
keywords: NOSOSCF
formula: C11H15Cl2O2PS2
InChI: InChI=1/C11H15Cl2O2PS2/c1-3-7-18-16(17,14-4-2)15-11-6-5-9(12)8-10(11)13/h5-6,8H,3-4,7H2,1-2H3
33 atoms
Cl -0.775677 0.882707 -2.604937
Cl -4.916759 -1.004974 0.246765
S  1.823834 -0.962789 -1.110393
S  1.95605 -0.070968 2.201527
P  1.798893 0.491052 0.368124
O  0.441477 1.343213 0.007608
O  2.87462 1.539694 -0.158927
C  2.229751 -2.514681 -0.221775
C  1.065273 -3.489201 -0.186298
C  -0.154895 -2.997044 0.572674
C  -0.80089 0.783447 0.088468
C  3.476106 2.532428 0.701318
C  -1.493047 0.508472 -1.086317
C  -1.398946 0.524492 1.311542
C  2.52224 3.63715 1.084327
C  -2.763867 -0.040936 -1.044777
C  -2.666874 -0.028316 1.368205
C  -3.33378 -0.313519 0.188119
H  2.572451 -2.26029 0.781572
H  3.076253 -2.939883 -0.760499
H  0.785685 -3.765943 -1.205581
H  1.446815 -4.401929 0.281092
H  -0.911666 -3.780509 0.627109
H  0.096379 -2.706369 1.593414
H  -0.614661 -2.138076 0.082566
H  3.883147 2.039687 1.586547
H  4.310824 2.921955 0.12142
H  -0.874208 0.763377 2.226264
H  2.090559 4.120777 0.208068
H  1.713856 3.283974 1.725162
H  3.073988 4.392838 1.644799
H  -3.295575 -0.251671 -1.962534
H  -3.124853 -0.228881 2.326919
elementType: Cl S P O C H
totalener: -2637.00772481 hartree
nucrepener: 2182.22179442 hartree
electener: -4819.22951923 hartree
oneelecener: -7976.76739310 hartree
twoeener: 3157.53787388 hartree
cpcmener: -0.01340981 hartree
kineticenergy: 2631.02469639 hartree
xcener: -154.156257619252 hartree
chargesum: 0.0000000
charge: -0.061964 -0.082530 -0.160928 -0.418411 0.633504 -0.343880 -0.345976 -0.096232 -0.076727 -0.243679 0.244497 0.023423 -0.002877 -0.177829 -0.232903 -0.090438 -0.133455 0.064633 0.110694 0.128875 0.069718 0.074307 0.100662 0.081178 0.037955 0.095308 0.111232 0.150367 0.090586 0.077380 0.098766 0.128106 0.146639
qa: -0.0620 -0.0825 -0.1609 -0.4184 0.6335 -0.3439 -0.3460 -0.0962 -0.0767 -0.2437 0.2445 0.0234 -0.0029 -0.1778 -0.2329 -0.0904 -0.1335 0.0646 0.1107 0.1289 0.0697 0.0743 0.1007 0.0812 0.0380 0.0953 0.1112 0.1504 0.0906 0.0774 0.0988 0.1281 0.1466
va: 1.2481 1.2180 2.3217 2.0257 5.3824 2.0841 2.1312 3.8554 3.8818 3.9390 3.7734 3.8699 3.9751 3.9624 3.8879 4.0024 3.9851 3.8753 1.0444 1.0108 1.0108 1.0099 1.0103 1.0069 1.0153 1.0094 0.9901 1.0077 1.0070 1.0182 1.0089 1.0169 1.0028
dispcorr: -0.019727678 hartree
energy: -2637.027452483338
dipole: 19.24258 -18.70884 0.53375 -4.90994 4.76347 -0.14646 11.41290 -11.08084 0.33206
magnitude: 0.64544 au
magnitude: 1.64058 debye
