program: Gaussian 09
title: 000066469
version: EM64L-G09RevD.01
frameworkgroup: C1[X(C14H20)]
method: RPBEPBE
basis: SDD
operation: Freq
keyword: #p
keyword: freq=noraman
keyword: PBEPBE/SDD
title: #p freq=noraman PBEPBE/SDD
converged: YES YES NO NO
title: Mulliken charges:
elementType: C C C C C C C C C C C C C C H H H H H H H H H H H H H H H H H H H H
charge: 0.169912 0.183112 -0.561914 0.306092 0.308407 -0.753423 -0.734007 -0.753769 -0.733514 -0.605773 -0.439059 0.461885 -0.417625 -0.823699 0.216666 0.206154 0.207617 0.222523 0.214858 0.223770 0.214119 0.212440 0.222721 0.207311 0.214290 0.213561 0.223598 0.211973 0.241082 0.235881 0.226283 0.222580 0.223188 0.232762
chargesum: 0.00000
title: Mulliken charges with hydrogens summed into heavy atoms:
elementType: C C C C C C C C C C C C C C
charge: 0.169912 0.183112 -0.139095 0.306092 0.308407 -0.108425 -0.083678 -0.109447 -0.084383 -0.364691 -0.203178 0.461885 -0.191342 -0.145168
polarizability: 1.78923226e+02 2.70796229e-01 1.56461123e+02 7.20304632e-01 6.43488377e-03 1.05092850e+02
1716.lowfreq: -26.0386 -6.4102 -0.0005 0.0000 0.0002 5.7721 9.2503 74.3485 89.9609
frequency: -25.4458 74.3232 89.9542 113.6703 182.8799 190.6205 209.8594 221.5321 231.9530 240.5074 257.8414 278.2193 303.6917 306.7038 331.9234 363.0216 379.0583 404.4403 473.7843 513.3891 525.6062 540.8043 551.5927 596.1732 662.9187 715.3547 771.6469 818.4096 828.3230 841.7969 895.2708 898.1130 902.5116 927.5667 934.7599 950.7037 956.0273 960.3960 996.0114 998.3062 1009.9588 1045.8959 1056.9957 1070.4422 1123.4325 1137.2912 1172.8616 1191.5938 1197.5074 1211.5635 1214.1431 1267.4881 1281.7756 1289.9085 1314.6445 1368.7965 1372.2509 1374.9338 1389.9902 1392.2357 1396.1934 1418.5903 1458.5377 1460.1992 1462.4570 1466.6121 1472.8296 1473.9217 1474.5849 1476.7664 1479.5683 1480.4679 1485.6242 1492.1169 1590.8732 1621.5005 2966.8211 2968.6295 2970.6757 2971.1278 2972.8525 2988.2028 3046.2492 3051.4788 3058.4892 3060.5061 3064.7431 3066.9583 3071.6432 3074.2209 3078.0620 3080.5801 3084.0558 3106.1314 3109.0627 3133.4696
redmass: 1.0146 3.1465 2.5982 3.0958 2.5624 2.3249 1.1147 1.0592 1.6064 1.9523 1.1508 1.6796 2.4722 2.6155 2.8897 2.3621 2.3211 2.4990 3.6236 2.9028 2.6348 3.6423 3.7438 3.3191 4.0363 5.5509 3.7214 3.5890 1.3801 2.2380 1.8551 1.4162 2.7468 1.5331 1.3863 1.8162 1.4107 1.8233 1.4180 1.3081 1.3581 1.5939 2.7121 1.5541 1.7921 1.6455 2.1401 1.9742 3.7629 2.8912 1.9576 1.7114 1.6255 3.6076 1.7050 1.2105 4.6170 1.2542 1.2179 1.2178 1.2252 3.2904 1.0495 1.0661 1.0521 1.0527 1.0662 1.1307 1.1223 1.0605 1.0542 1.1995 1.2523 1.5886 7.0668 6.7986 1.0349 1.0350 1.0358 1.0383 1.0362 1.0603 1.1030 1.0948 1.0996 1.0997 1.0994 1.0985 1.1003 1.0998 1.0994 1.0996 1.0979 1.0910 1.0867 1.0965
irintensity: 0.5004 0.3700 0.0231 1.4847 0.1018 0.0785 0.0442 0.0060 0.4181 0.3269 0.1265 0.0756 0.4846 0.3797 0.3427 0.2444 0.1001 2.1241 0.1035 12.6022 0.3455 0.1275 0.1012 3.2170 0.0080 0.2769 0.0376 0.3920 33.6042 5.2181 1.2977 4.1603 3.5639 0.4304 1.0996 2.1001 0.7795 4.1122 2.3950 0.7098 0.4989 13.5853 9.5775 0.4791 7.6471 6.2411 6.1035 3.0960 9.6161 3.4029 1.9199 1.3553 1.9272 14.7488 15.0648 0.1511 5.9708 33.5833 14.0349 3.1238 8.8112 5.2128 1.2936 3.9765 0.2056 4.0272 15.9638 4.4208 23.5570 9.7516 2.1879 6.2431 2.2143 44.5418 1.7725 6.4008 24.9003 28.9535 68.0197 30.3668 34.2171 46.3290 17.1958 24.4842 2.4083 6.3649 11.2999 133.5142 6.0941 55.8235 78.5627 19.2766 12.2801 24.2478 15.3133 27.7978
temp: 298.150 k
press: 1.00000 atm
elementType: 6 6 6 6 6 6 6 6 6 6 6 6 6 6 1 1 1 1 1 1 1 1 1 1 1 1 1 1 1 1 1 1 1 1
symmnumber: 1
zpe: 780911.3 jmol-1
zpe.correction: 0.297433 hartree
zpe.thermalcorrener: 0.311513 hartree
zpe.thermalcorrenthalpy: 0.312458 hartree
zpe.thermalcorrgfe: 0.258391 hartree
zpe.sumelectzpe: -544.441458 hartree
zpe.sumelectthermal: -544.427378 hartree
zpe.sumelectthermalent: -544.426433 hartree
zpe.sumelectthermalfe: -544.480500 hartree
dipole: -0.1458 0.2446 0.0850
dipole: 0.2972
quadrupole: -80.9588 -82.8104 -89.7677
quadrupole: 0.1426 0.3603 -0.0537
quadrupole: 3.5535 1.7019 -5.2554 0.1426 0.3603 -0.0537
hfenergy: -544.738891 hartree
pointgroup: C01 [X(C14H20)]
dipole: -0.0615282 -0.0936447 -0.0333699 debye
polarizability: 178.8557796|-1.2419618|156.5267254|-0.8082153|0.0421593|105.0946936 unknown
InChI: InChI=1S/C14H20/c1-10-6-7-11-12(8-10)14(4,5)9-13(11,2)3/h6-8H,9H2,1-5H3
charge 0 multiplicity 1
34 atoms
C  -1.028572 -1.471921 0.055639
C  -1.673938 0.997708 0.043573
C  -2.180132 -0.452083 0.383192
C  0.207892 -0.562823 0.042327
C  -0.151614 0.806599 0.03639
C  -0.936386 -2.581324 1.134873
C  -1.223593 -2.140197 -1.337604
C  -2.136721 2.020619 1.112844
C  -2.168062 1.473025 -1.354719
C  1.564396 -0.94602 0.015747
C  0.85203 1.796478 0.004814
C  2.587684 0.038263 -0.01432
C  2.212398 1.408647 -0.015466
C  4.05337 -0.362326 -0.066145
H  -2.40272 -0.504752 1.466602
H  -3.112964 -0.699191 -0.156988
H  -0.118807 -3.292485 0.911525
H  -0.748749 -2.148492 2.134364
H  -1.879524 -3.15848 1.179657
H  -1.310283 -1.387405 -2.140918
H  -0.36571 -2.794613 -1.581295
H  -2.140133 -2.760495 -1.343766
H  -1.765683 1.741992 2.115932
H  -1.76752 3.038017 0.88266
H  -3.241714 2.066723 1.153057
H  -1.737177 2.460136 -1.606418
H  -1.875338 0.765907 -2.150723
H  -3.270705 1.567681 -1.363637
H  1.842703 -2.008233 0.027086
H  0.588908 2.861403 0.008814
H  2.996628 2.176036 -0.028594
H  4.696949 0.390609 0.422647
H  4.226291 -1.333268 0.43122
H  4.403797 -0.463034 -1.112271
