program: Orca
programVersion: 5.0.2
elementType: Cl Cl S S P O O C C C C C C C C C C C H H H H H H H H H H H H H H H
charge: 0
multiplicity: 1
keywords: wb97x-d3
keywords: def2-TZVPP
keywords: def2/J RIJCOSX
keywords: DEFGRID2
keywords: scfconv7
keywords: smallprint printgap noloewdin
keywords: NOSOSCF
formula: C11H15Cl2O2PS2
InChI: InChI=1/C11H15Cl2O2PS2/c1-3-7-18-16(17,14-4-2)15-11-6-5-9(12)8-10(11)13/h5-6,8H,3-4,7H2,1-2H3
33 atoms
Cl -1.540511 -2.124976 -1.24968
Cl -5.339956 1.306419 0.370984
S  3.023799 -0.876942 -0.503347
S  1.218832 0.284789 2.151344
P  1.562044 0.368353 0.264522
O  0.280113 0.043971 -0.691222
O  1.97369 1.782474 -0.354363
C  2.972906 -2.292621 0.654591
C  1.78723 -3.219906 0.471052
C  1.726412 -3.885179 -0.892414
C  -1.008069 0.376994 -0.39922
C  3.085798 2.539703 0.170051
C  -1.98993 -0.578804 -0.640758
C  -1.379536 1.623848 0.080457
C  2.691305 3.990666 0.247701
C  -3.327229 -0.298554 -0.414132
C  -2.711721 1.91356 0.321905
C  -3.674548 0.949549 0.074519
H  3.024373 -1.894215 1.667813
H  3.91236 -2.815221 0.462131
H  1.868352 -3.984614 1.24908
H  0.85919 -2.68158 0.675184
H  1.595878 -3.158552 -1.694854
H  2.639794 -4.446853 -1.098456
H  0.892287 -4.585299 -0.945106
H  3.371048 2.165376 1.155993
H  3.931211 2.393964 -0.503387
H  -0.638051 2.391666 0.254296
H  2.392718 4.378914 -0.726443
H  1.874361 4.144308 0.952929
H  3.545422 4.575031 0.590892
H  -4.079791 -1.049419 -0.612272
H  -2.986769 2.889666 0.696115
elementType: Cl S P O C H
totalener: -2637.01227244 hartree
nucrepener: 2127.80875608 hartree
electener: -4764.82102852 hartree
oneelecener: -7867.76517326 hartree
twoeener: 3102.94414474 hartree
cpcmener: -0.01464589 hartree
kineticenergy: 2631.01322219 hartree
xcener: -154.151868432536 hartree
chargesum: 0.0000000
charge: -0.067576 -0.084045 -0.148805 -0.417069 0.623461 -0.323393 -0.345278 -0.111822 -0.078859 -0.273496 0.204496 0.034455 0.033439 -0.144644 -0.242895 -0.109258 -0.150566 0.069096 0.128971 0.128188 0.083421 0.040773 0.070615 0.094684 0.097474 0.089082 0.104894 0.147947 0.091532 0.084181 0.096895 0.129581 0.144521
qa: -0.0676 -0.0840 -0.1488 -0.4171 0.6235 -0.3234 -0.3453 -0.1118 -0.0789 -0.2735 0.2045 0.0345 0.0334 -0.1446 -0.2429 -0.1093 -0.1506 0.0691 0.1290 0.1282 0.0834 0.0408 0.0706 0.0947 0.0975 0.0891 0.1049 0.1479 0.0915 0.0842 0.0969 0.1296 0.1445
va: 1.2461 1.2168 2.3211 2.0257 5.3889 2.1301 2.1081 3.8648 3.8539 3.9256 3.8172 3.8611 3.9500 3.9502 3.9457 4.0166 4.0231 3.8732 1.0283 1.0043 1.0097 1.0369 1.0162 1.0054 1.0023 1.0061 0.9940 1.0033 1.0042 1.0075 1.0076 1.0162 1.0042
dispcorr: -0.018293374 hartree
energy: -2637.030565813841
dipole: 29.27814 -27.94042 1.33773 -0.89221 1.32256 0.43035 2.52779 -2.61172 -0.08393
magnitude: 1.40775 au
magnitude: 3.57821 debye
