program: Orca
programVersion: 5.0.2
elementType: Cl Cl S S P O O C C C C C C C C C C C H H H H H H H H H H H H H H H
charge: 0
multiplicity: 1
keywords: wb97x-d3
keywords: def2-TZVPP
keywords: def2/J RIJCOSX
keywords: DEFGRID2
keywords: scfconv7
keywords: smallprint printgap noloewdin
keywords: NOSOSCF
formula: C11H15Cl2O2PS2
InChI: InChI=1/C11H15Cl2O2PS2/c1-3-7-18-16(17,14-4-2)15-11-6-5-9(12)8-10(11)13/h5-6,8H,3-4,7H2,1-2H3
33 atoms
Cl -0.426759 1.35464 -2.23417
Cl -4.749883 -1.259459 -0.408775
S  2.013568 -0.834955 -0.684634
S  1.840294 -0.27367 2.68323
P  1.777641 0.477953 0.92042
O  0.413329 1.323489 0.563486
O  2.850815 1.626318 0.70632
C  1.827558 -2.484446 0.087824
C  0.389215 -2.932835 0.256639
C  -0.379946 -3.049333 -1.047686
C  -0.783788 0.704323 0.35653
C  3.052363 2.347394 -0.531948
C  -1.303963 0.649986 -0.932182
C  -1.509213 0.16982 1.40976
C  2.455482 3.728804 -0.45702
C  -2.529459 0.051658 -1.175465
C  -2.732806 -0.436182 1.180999
C  -3.227342 -0.49599 -0.111491
H  2.369943 -2.483227 1.032345
H  2.366121 -3.143187 -0.596912
H  0.420955 -3.908596 0.750894
H  -0.126554 -2.260828 0.945336
H  0.082273 -3.779365 -1.715225
H  -1.405335 -3.373007 -0.866387
H  -0.42611 -2.098503 -1.579686
H  4.13233 2.394668 -0.663784
H  2.646978 1.792214 -1.381237
H  -1.119502 0.233413 2.416543
H  2.839359 4.282546 0.399735
H  2.731744 4.278133 -1.357924
H  1.368428 3.705798 -0.401472
H  -2.925043 0.011618 -2.18103
H  -3.289346 -0.853833 2.008406
elementType: Cl S P O C H
totalener: -2637.00862486 hartree
nucrepener: 2205.82929624 hartree
electener: -4842.83792109 hartree
oneelecener: -8023.28909436 hartree
twoeener: 3180.45117326 hartree
cpcmener: -0.01477935 hartree
kineticenergy: 2631.01450280 hartree
xcener: -154.154920057936 hartree
chargesum: 0.0000000
charge: -0.064435 -0.083094 -0.184095 -0.406966 0.611283 -0.339221 -0.343149 -0.089593 -0.083783 -0.283373 0.238623 0.028219 0.008776 -0.185352 -0.234610 -0.104816 -0.115958 0.068337 0.125997 0.129092 0.086443 0.053904 0.101783 0.095709 0.071127 0.114462 0.091274 0.153742 0.092854 0.095866 0.074977 0.129105 0.146874
qa: -0.0644 -0.0831 -0.1841 -0.4070 0.6113 -0.3392 -0.3431 -0.0896 -0.0838 -0.2834 0.2386 0.0282 0.0088 -0.1854 -0.2346 -0.1048 -0.1160 0.0683 0.1260 0.1291 0.0864 0.0539 0.1018 0.0957 0.0711 0.1145 0.0913 0.1537 0.0929 0.0959 0.0750 0.1291 0.1469
va: 1.2442 1.2159 2.2921 2.0457 5.4198 2.0779 2.1345 3.8601 3.8712 3.9430 3.7270 3.8691 3.9545 3.9881 3.9205 3.9622 3.9814 3.8421 1.0324 1.0040 1.0120 1.0240 1.0054 1.0011 1.0071 0.9974 0.9965 1.0081 1.0059 1.0064 1.0211 1.0171 1.0018
dispcorr: -0.021482059 hartree
energy: -2637.030106917177
dipole: 14.36214 -14.42506 -0.06291 -5.46892 5.15816 -0.31076 -0.44077 -0.72880 -1.16957
magnitude: 1.21179 au
magnitude: 3.08012 debye
