program: Orca
programVersion: 5.0.2
elementType: Cl Cl S S P O O C C C C C C C C C C C H H H H H H H H H H H H H H H
charge: 0
multiplicity: 1
keywords: wb97x-d3
keywords: def2-TZVPP
keywords: def2/J RIJCOSX
keywords: DEFGRID2
keywords: scfconv7
keywords: smallprint printgap noloewdin
keywords: NOSOSCF
formula: C11H15Cl2O2PS2
InChI: InChI=1/C11H15Cl2O2PS2/c1-3-7-18-16(17,14-4-2)15-11-6-5-9(12)8-10(11)13/h5-6,8H,3-4,7H2,1-2H3
33 atoms
Cl -1.22929 3.091319 -0.952923
Cl -5.364399 -0.089522 0.322146
S  1.878221 -1.624703 -1.294589
S  1.458355 -0.356872 1.876693
P  1.627806 -0.022596 -0.006512
O  0.345062 0.695049 -0.724713
O  2.772547 0.986601 -0.457121
C  2.94282 -2.742947 -0.303456
C  2.144364 -3.774785 0.472242
C  3.062203 -4.694352 1.265575
C  -0.964508 0.457158 -0.440687
C  3.292277 2.023572 0.406186
C  -1.83935 1.536587 -0.532695
C  -1.46523 -0.791906 -0.104537
C  2.341522 3.184299 0.560696
C  -3.195191 1.375379 -0.30404
C  -2.818248 -0.964174 0.135739
C  -3.672565 0.120007 0.034066
H  3.581164 -2.14589 0.348119
H  3.594464 -3.22049 -1.036711
H  1.453036 -3.268074 1.147517
H  1.539765 -4.361491 -0.222918
H  2.484147 -5.437247 1.81622
H  3.753148 -5.231761 0.61362
H  3.655908 -4.135534 1.991005
H  3.547163 1.590629 1.375376
H  4.216623 2.336262 -0.075871
H  -0.811221 -1.651367 -0.043922
H  2.062663 3.60776 -0.403691
H  1.435684 2.905627 1.098887
H  2.838733 3.964609 1.138117
H  -3.862399 2.222477 -0.3852
H  -3.19326 -1.944183 0.395708
elementType: Cl S P O C H
totalener: -2637.00980344 hartree
nucrepener: 2107.82082655 hartree
electener: -4744.83063000 hartree
oneelecener: -7827.67225655 hartree
twoeener: 3082.84162655 hartree
cpcmener: -0.01435512 hartree
kineticenergy: 2631.00677233 hartree
xcener: -154.150944961439 hartree
chargesum: -0.0000000
charge: -0.067043 -0.084818 -0.155484 -0.415711 0.628092 -0.329901 -0.339285 -0.081498 -0.102208 -0.261764 0.231120 0.033598 0.019107 -0.133143 -0.238447 -0.108370 -0.170653 0.072260 0.108795 0.130650 0.063837 0.070566 0.093431 0.083963 0.083513 0.095909 0.111234 0.128824 0.087563 0.073119 0.100788 0.127934 0.144024
qa: -0.0670 -0.0848 -0.1555 -0.4157 0.6281 -0.3299 -0.3393 -0.0815 -0.1022 -0.2618 0.2311 0.0336 0.0191 -0.1331 -0.2384 -0.1084 -0.1707 0.0723 0.1088 0.1306 0.0638 0.0706 0.0934 0.0840 0.0835 0.0959 0.1112 0.1288 0.0876 0.0731 0.1008 0.1279 0.1440
va: 1.2447 1.2164 2.2959 2.0176 5.3846 2.1400 2.1231 3.8505 3.8862 3.9512 3.8020 3.8514 3.9506 3.9464 3.8951 4.0168 4.0747 3.8730 1.0258 1.0070 1.0257 1.0126 1.0040 1.0017 1.0025 1.0101 0.9913 1.0120 1.0077 1.0219 1.0108 1.0171 1.0050
dispcorr: -0.017629520 hartree
energy: -2637.027432964699
dipole: 32.07743 -30.78514 1.29229 -17.87047 17.18053 -0.68994 8.11639 -8.16472 -0.04833
magnitude: 1.46573 au
magnitude: 3.72559 debye
