program: Orca
programVersion: 5.0.2
elementType: Cl Cl S S P O O C C C C C C C C C C C H H H H H H H H H H H H H H H
charge: 0
multiplicity: 1
keywords: wb97x-d3
keywords: def2-TZVPP
keywords: def2/J RIJCOSX
keywords: DEFGRID2
keywords: scfconv7
keywords: smallprint printgap noloewdin
keywords: NOSOSCF
formula: C11H15Cl2O2PS2
InChI: InChI=1/C11H15Cl2O2PS2/c1-3-7-18-16(17,14-4-2)15-11-6-5-9(12)8-10(11)13/h5-6,8H,3-4,7H2,1-2H3
33 atoms
Cl -1.586995 -2.204412 -0.35076
Cl -5.391931 1.523936 0.315668
S  2.803878 -0.831667 -1.076151
S  0.992448 0.192724 1.667268
P  1.362912 0.365733 -0.209188
O  0.077689 0.053021 -1.176474
O  1.795523 1.805685 -0.74609
C  2.473356 -2.447978 -0.276434
C  3.338493 -2.688408 0.946011
C  3.032078 -4.042097 1.570314
C  -1.184995 0.421859 -0.807078
C  2.448164 2.790156 0.083273
C  -2.083983 -0.557157 -0.39992
C  -1.595648 1.743717 -0.865326
C  3.896749 2.460801 0.342048
C  -3.383821 -0.225266 -0.055711
C  -2.891218 2.091103 -0.523437
C  -3.772643 1.102636 -0.116082
H  2.671031 -3.187521 -1.053014
H  1.412079 -2.515982 -0.039313
H  4.391691 -2.638021 0.661999
H  3.167319 -1.894166 1.674096
H  1.989566 -4.107087 1.886339
H  3.217778 -4.858387 0.870103
H  3.653375 -4.215416 2.449274
H  2.35227 3.721884 -0.471712
H  1.894968 2.897915 1.018147
H  -0.904438 2.507867 -1.195306
H  4.350151 3.285109 0.893752
H  4.011212 1.559684 0.945384
H  4.453855 2.3337 -0.586195
H  -4.076557 -0.993673 0.258604
H  -3.203639 3.124656 -0.575933
elementType: Cl S P O C H
totalener: -2637.01140761 hartree
nucrepener: 2124.58861261 hartree
electener: -4761.60002022 hartree
oneelecener: -7861.48206794 hartree
twoeener: 3099.88204772 hartree
cpcmener: -0.01486605 hartree
kineticenergy: 2631.01972745 hartree
xcener: -154.151237706697 hartree
chargesum: 0.0000000
charge: -0.064505 -0.081799 -0.145687 -0.416725 0.623900 -0.343599 -0.355142 -0.070208 -0.096752 -0.265458 0.197044 0.039404 0.017998 -0.155134 -0.243821 -0.098120 -0.132458 0.062288 0.128884 0.091660 0.070604 0.061815 0.082873 0.084151 0.093622 0.109638 0.096501 0.160508 0.101239 0.078415 0.092673 0.129467 0.146723
qa: -0.0645 -0.0818 -0.1457 -0.4167 0.6239 -0.3436 -0.3551 -0.0702 -0.0968 -0.2655 0.1970 0.0394 0.0180 -0.1551 -0.2438 -0.0981 -0.1325 0.0623 0.1289 0.0917 0.0706 0.0618 0.0829 0.0842 0.0936 0.1096 0.0965 0.1605 0.1012 0.0784 0.0927 0.1295 0.1467
va: 1.2457 1.2189 2.3077 2.0215 5.4001 2.1094 2.1093 3.8501 3.9047 3.9522 3.8225 3.8450 3.9852 4.0021 3.9136 4.0098 3.9952 3.8812 1.0087 1.0386 1.0139 1.0266 1.0023 1.0011 1.0043 0.9908 1.0103 0.9992 1.0110 1.0149 1.0037 1.0154 1.0019
dispcorr: -0.017946796 hartree
energy: -2637.029354403412
dipole: 36.25574 -35.23281 1.02293 -4.01590 4.60618 0.59028 6.93177 -7.24305 -0.31128
magnitude: 1.22135 au
magnitude: 3.10443 debye
