program: Gaussian 09
title: 000066456
version: EM64L-G09RevD.01
frameworkgroup: C1[X(C7H10N2O3S)]
method: RPBEPBE
basis: SDD
operation: Freq
keyword: #p
keyword: freq=noraman
keyword: PBEPBE/SDD
title: #p freq=noraman PBEPBE/SDD
converged: YES YES NO NO
title: Mulliken charges:
elementType: S O O O N N C C C C C C C H H H H H H H H H H
charge: 0.988565 -0.540937 -0.533650 -0.400094 -0.474697 -0.724129 -0.112244 -0.308863 -0.223927 0.135572 0.184747 -0.311441 -0.603934 0.299702 0.283319 0.310306 0.265995 0.251519 0.273723 0.214597 0.322539 0.317574 0.385756
chargesum: 0.00000
title: Mulliken charges with hydrogens summed into heavy atoms:
elementType: S O O O N N C C C C C C C
charge: 0.988565 -0.540937 -0.533650 -0.014338 -0.164391 -0.084016 -0.112244 -0.009160 0.059392 0.135572 0.184747 -0.045446 0.135905
polarizability: 1.69588891e+02 1.58035401e+00 1.26251322e+02 6.96729236e-01 7.45488703e+00 8.69252260e+01
1716.lowfreq: -6.1789 -2.1594 -0.0018 -0.0010 -0.0009 10.8044 36.5361 48.1465 79.0719
frequency: 36.4419 48.1463 79.0550 116.0183 123.9209 150.1790 188.1650 209.0406 220.4089 233.2802 274.8729 291.4438 296.3088 331.8221 357.9445 425.3483 437.3563 444.3207 472.3056 561.0902 571.7728 615.5645 697.0044 729.1458 735.0108 767.3330 809.2635 830.4405 850.0689 859.0124 904.9411 950.4099 958.4162 1031.8052 1044.7543 1095.1548 1101.6367 1109.9174 1147.4795 1174.5858 1225.8153 1242.4456 1313.5200 1331.5462 1402.3615 1413.4515 1427.5887 1462.7069 1474.7692 1483.9570 1572.4708 1614.4304 1634.6674 2935.0127 3050.4249 3097.7848 3147.9339 3150.6185 3163.5088 3181.2687 3440.7835 3454.3387 3567.2633
redmass: 3.9224 3.7473 2.5779 1.7809 6.5364 1.7542 1.4273 3.2649 8.1016 5.0682 5.6696 5.0556 4.5380 4.9096 3.4718 9.4207 3.4501 4.4441 5.7696 3.6203 5.8412 7.2712 1.7636 3.4101 1.3312 5.4502 10.2936 1.4784 1.0763 6.2348 1.3220 6.6496 1.4065 2.8104 2.1132 1.4602 1.5570 1.8324 1.3114 1.5459 1.8623 1.9075 2.3222 1.2266 3.7034 1.1253 3.5744 1.0481 3.6352 1.0581 4.1491 6.5668 1.2117 1.0450 1.0882 1.0995 1.0924 1.0898 1.0617 1.0959 1.0764 1.0453 1.0976
irintensity: 3.1161 2.8390 10.2262 3.0776 4.8547 9.0468 3.2783 0.4393 9.0485 4.3805 4.7235 11.6705 14.1143 28.9793 36.0800 46.8702 37.9670 111.3744 52.3040 23.0681 11.3377 18.0777 31.9140 3.5413 165.4252 21.3449 105.3148 74.1567 103.7122 34.1300 16.9206 68.3068 2.6559 3.1638 44.0939 22.3563 20.5727 3.4520 1.6546 53.1175 118.0984 108.2520 41.9031 2.0757 35.6266 13.2513 21.0825 19.3995 133.3249 13.5982 52.5399 5.3012 43.2762 60.1920 21.4882 3.5033 4.1617 0.6767 176.7789 4.5404 18.1519 8.7567 18.7484
temp: 298.150 k
press: 1.00000 atm
elementType: 16 8 8 8 7 7 6 6 6 6 6 6 6 1 1 1 1 1 1 1 1 1 1
symmnumber: 1
zpe: 443036.1 jmol-1
zpe.correction: 0.168744 hartree
zpe.thermalcorrener: 0.182976 hartree
zpe.thermalcorrenthalpy: 0.183920 hartree
zpe.thermalcorrgfe: 0.127260 hartree
zpe.sumelectzpe: -1004.805700 hartree
zpe.sumelectthermal: -1004.791467 hartree
zpe.sumelectthermalent: -1004.790523 hartree
zpe.sumelectthermalfe: -1004.847183 hartree
dipole: -4.5444 -3.7289 3.7038
dipole: 6.9480
quadrupole: -97.4885 -77.1177 -83.9931
quadrupole: 6.3782 16.4430 2.2376
quadrupole: -11.2888 9.0821 2.2067 6.3782 16.4430 2.2376
hfenergy: -1004.9744433 hartree
pointgroup: C01 [X(C7H10N2O3S1)]
dipole: -1.8205805 -1.5090136 1.3713734 debye
dipolederiv: 2.0653074 -0.0853113 0.0020223 -0.0952202 1.1543368 -0.1232943 0.136569 -0.2311774 1.5864965 -0.7112221 0.0452578 0.0161612 0.1076357 -0.5592607 -0.1337715 0.052151 -0.013755 -0.578643 -0.7305701 -0.047079 0.0282111 -0.0884364 -0.6533459 0.1453657 -0.0238529 0.01176 -0.5006727 -1.5689659 -0.0601463 0.0561278 -0.0303114 -0.3236088 0.014442 0.127146 0.0266371 -0.3804583 -0.7763798 -0.0987577 0.0359979 -0.0895381 -0.4312717 0.0956959 -0.0932255 0.1364866 -0.5627446 -0.7623729 -0.0600854 0.0371959 -0.1814774 -0.5546838 -0.1506673 0.009788 -0.1571322 -0.2413903 -0.3412477 0.0023235 0.0104017 -0.0157408 -0.297379 -0.0110691 -0.0215188 0.0351988 -0.3239032 -0.0425513 0.0007395 -0.0299911 0.2279277 -0.0473982 0.0022151 0.0665813 0.0199563 -0.0609594 0.0030161 -0.0316398 -0.0633601 -0.2170677 0.0833477 0.0686102 -0.1067976 0.0307015 -0.0690522 -0.0485836 0.1393491 0.0353521 0.611163 0.4007098 0.1477304 0.2398666 0.180417 -0.0279144 1.4740621 0.0534891 -0.0963539 -0.049433 0.0003758 -0.0445971 -0.1799361 -0.0348679 0.1015394 -0.3553916 0.0070838 0.0139827 -0.2438174 0.0423234 0.0958319 -0.0589143 0.059143 -0.1216082 0.1750839 0.1416415 -0.2046711 -0.0407063 0.2790895 -0.2241044 -0.1494839 0.0300445 -0.0166179 0.1524614 0.0481017 0.0284378 0.0135187 0.0566873 -0.0245618 0.0030158 -0.0372331 0.1286631 0.1053855 -0.0785089 -0.0151017 -0.0394856 0.0734726 -0.027795 -0.0084873 -0.0071643 0.1413567 0.3083873 0.1104256 0.0188922 0.1121173 0.0288237 0.0567841 0.015325 0.0081184 0.061477 0.0264411 0.0520889 0.0301519 0.0406114 0.0146224 -0.0572146 0.0321537 -0.0610128 0.149344 0.0304807 0.0010707 -0.0760473 0.054376 0.0496815 0.1166148 -0.1216505 0.0976721 -0.019396 0.1282574 -0.0435741 0.0462599 -0.0113807 0.0525782 -0.0451307 0.0602946 -0.1433751 0.0471525 -0.1194772 -0.1001217 0.1680997 0.005967 -0.014302 0.0706499 0.1004476 0.0372064 0.030921 0.3010143 -0.022586 0.0621028 -0.0825255 0.1556968 -0.0399921 0.0010032 -0.0169464 0.1134934 0.2514805 0.041383 -0.0940421 -0.0233317 0.1080605 0.0420518 -0.0801838 0.0071046 0.2003733 0.4353843 -0.0151441 -0.0098297 0.0351555 0.3814441 0.026206 -0.0002911 0.0222178 0.3425433 unknown
polarizability: 169.5256298|1.2816047|125.7307278|2.5083907|8.7188378|87.5090811 unknown
InChI: InChI=1S/C7H10N2O3S/c1-9-13(11,12)5-2-3-7(10)6(8)4-5/h2-4,9-10H,8H2,1H3
charge 0 multiplicity 1
23 atoms
S  2.132473 0.222053 -0.418431
O  2.386782 -1.035984 -1.416821
O  2.661061 1.734639 -0.686092
O  -3.853917 0.482235 0.385631
N  2.945219 -0.262997 1.159315
N  -2.864174 -1.792237 -0.583204
C  0.261851 0.309249 -0.148621
C  -0.506633 -0.822275 -0.478483
C  -0.292747 1.512335 0.330847
C  -1.900199 -0.745199 -0.293144
C  -2.484004 0.458195 0.215314
C  -1.687366 1.587514 0.519012
C  2.60039 -1.60111 1.673497
H  -0.02756 -1.714524 -0.896665
H  0.350278 2.378555 0.51924
H  2.869777 0.530861 1.814551
H  -2.165109 2.50026 0.884365
H  3.332358 -1.852815 2.461205
H  2.729673 -2.327779 0.853913
H  1.574598 -1.694578 2.091716
H  -2.997828 -1.992909 -1.580575
H  -2.75749 -2.650029 -0.031878
H  -4.148134 -0.444561 0.090809
