program: Orca
programVersion: 5.0.2
elementType: Cl Cl S S P O O C C C C C C C C C C C H H H H H H H H H H H H H H H
charge: 0
multiplicity: 1
keywords: wb97x-d3
keywords: def2-TZVPP
keywords: def2/J RIJCOSX
keywords: DEFGRID2
keywords: scfconv7
keywords: smallprint printgap noloewdin
keywords: NOSOSCF
formula: C11H15Cl2O2PS2
InChI: InChI=1/C11H15Cl2O2PS2/c1-3-7-18-16(17,14-4-2)15-11-6-5-9(12)8-10(11)13/h5-6,8H,3-4,7H2,1-2H3
33 atoms
Cl -1.445589 -1.779197 -1.717723
Cl -5.428481 0.926638 0.663255
S  2.855889 -0.564884 -0.977361
S  1.031456 0.003932 1.882186
P  1.455091 0.524399 0.082245
O  0.184856 0.489708 -0.948985
O  1.958424 2.020047 -0.15876
C  2.33996 -2.281129 -0.581524
C  3.094387 -2.865525 0.596665
C  2.622582 -4.280556 0.894357
C  -1.109394 0.619813 -0.53952
C  2.76063 2.74865 0.794864
C  -2.003251 -0.39686 -0.855169
C  -1.561541 1.734343 0.149981
C  4.190939 2.273971 0.83526
C  -3.338566 -0.305843 -0.497116
C  -2.890676 1.835208 0.523641
C  -3.766487 0.811631 0.19943
H  2.531561 -2.845407 -1.495384
H  1.26152 -2.300151 -0.420884
H  4.165113 -2.865213 0.380258
H  2.94716 -2.232383 1.4733
H  1.561124 -4.300094 1.147751
H  2.771825 -4.943537 0.040363
H  3.169473 -4.702768 1.737893
H  2.703019 3.783433 0.460858
H  2.29418 2.68541 1.779858
H  -0.880484 2.540462 0.388006
H  4.649783 2.293039 -0.153558
H  4.76253 2.943151 1.479705
H  4.281872 1.26761 1.244158
H  -4.026067 -1.100647 -0.751295
H  -3.232051 2.707836 1.062899
elementType: Cl S P O C H
totalener: -2637.01078439 hartree
nucrepener: 2119.05985329 hartree
electener: -4756.07063768 hartree
oneelecener: -7850.28292449 hartree
twoeener: 3094.21228681 hartree
cpcmener: -0.01497708 hartree
kineticenergy: 2631.00855650 hartree
xcener: -154.150087126000 hartree
chargesum: 0.0000000
charge: -0.067826 -0.083582 -0.145595 -0.417221 0.622827 -0.337864 -0.350783 -0.064339 -0.101109 -0.263610 0.197650 0.039235 0.025012 -0.146476 -0.248527 -0.107962 -0.138008 0.068385 0.131558 0.081636 0.070973 0.063383 0.083147 0.083392 0.093230 0.110168 0.095953 0.154330 0.093645 0.102027 0.079716 0.129940 0.146694
qa: -0.0678 -0.0836 -0.1456 -0.4172 0.6228 -0.3379 -0.3508 -0.0643 -0.1011 -0.2636 0.1977 0.0392 0.0250 -0.1465 -0.2485 -0.1080 -0.1380 0.0684 0.1316 0.0816 0.0710 0.0634 0.0831 0.0834 0.0932 0.1102 0.0960 0.1543 0.0936 0.1020 0.0797 0.1299 0.1467
va: 1.2442 1.2170 2.3053 2.0197 5.3962 2.1232 2.1026 3.8486 3.9101 3.9504 3.8229 3.8463 3.9735 3.9623 3.9123 4.0257 3.9975 3.8750 1.0068 1.0413 1.0139 1.0277 1.0022 1.0016 1.0041 0.9901 1.0098 0.9981 1.0025 1.0111 1.0141 1.0157 1.0026
dispcorr: -0.017845677 hartree
energy: -2637.028630064414
dipole: 35.21140 -34.13809 1.07330 -5.89654 6.40453 0.50799 9.05976 -9.02160 0.03816
magnitude: 1.18806 au
magnitude: 3.01981 debye
