program: Orca
programVersion: 5.0.2
elementType: Cl Cl S S P O O C C C C C C C C C C C H H H H H H H H H H H H H H H
charge: 0
multiplicity: 1
keywords: wb97x-d3
keywords: def2-TZVPP
keywords: def2/J RIJCOSX
keywords: DEFGRID2
keywords: scfconv7
keywords: smallprint printgap noloewdin
keywords: NOSOSCF
formula: C11H15Cl2O2PS2
InChI: InChI=1/C11H15Cl2O2PS2/c1-3-7-18-16(17,14-4-2)15-11-6-5-9(12)8-10(11)13/h5-6,8H,3-4,7H2,1-2H3
33 atoms
Cl -0.79211 2.716641 0.196314
Cl -5.72951 0.630389 -0.202123
S  1.847884 -2.024098 -0.720592
S  0.396392 -0.594642 2.019816
P  1.107567 -0.346032 0.260148
O  0.057832 0.135174 -0.901874
O  2.225013 0.787485 0.211287
C  2.793003 -2.818678 0.630309
C  4.040526 -2.076447 1.072958
C  5.051643 -1.838478 -0.035457
C  -1.288032 0.229046 -0.70446
C  2.803704 1.281306 -1.015122
C  -1.833098 1.405649 -0.204077
C  -2.119187 -0.82649 -1.038225
C  4.107253 1.959621 -0.68375
C  -3.202613 1.537393 -0.047688
C  -3.490848 -0.709337 -0.889722
C  -4.018269 0.472059 -0.392677
H  3.048247 -3.79731 0.219267
H  2.106957 -2.983454 1.461393
H  3.768286 -1.133229 1.551323
H  4.496705 -2.686184 1.857923
H  5.94647 -1.35391 0.355358
H  5.360869 -2.778613 -0.496644
H  4.650353 -1.202381 -0.825343
H  2.965625 0.456882 -1.714547
H  2.103643 1.982869 -1.472145
H  -1.692163 -1.741165 -1.429054
H  3.963427 2.793578 0.003822
H  4.823464 1.264838 -0.244528
H  4.543904 2.355832 -1.600478
H  -3.621449 2.456034 0.339319
H  -4.135404 -1.535028 -1.157666
elementType: Cl S P O C H
totalener: -2637.01213365 hartree
nucrepener: 2131.91077393 hartree
electener: -4768.92290758 hartree
oneelecener: -7876.04901654 hartree
twoeener: 3107.12610896 hartree
cpcmener: -0.01683758 hartree
kineticenergy: 2631.00970912 hartree
xcener: -154.151058548045 hartree
chargesum: 0.0000000
charge: -0.059993 -0.082225 -0.165064 -0.398223 0.601502 -0.364193 -0.319765 -0.112440 -0.090622 -0.281510 0.248923 -0.001368 0.004716 -0.177627 -0.235123 -0.098416 -0.122102 0.061373 0.128049 0.127405 0.060354 0.085731 0.100550 0.097834 0.071620 0.113232 0.111082 0.148365 0.093516 0.085396 0.091088 0.130680 0.147255
qa: -0.0600 -0.0822 -0.1651 -0.3982 0.6015 -0.3642 -0.3198 -0.1124 -0.0906 -0.2815 0.2489 -0.0014 0.0047 -0.1776 -0.2351 -0.0984 -0.1221 0.0614 0.1280 0.1274 0.0604 0.0857 0.1005 0.0978 0.0716 0.1132 0.1111 0.1484 0.0935 0.0854 0.0911 0.1307 0.1473
va: 1.2556 1.2183 2.2865 2.0641 5.4064 2.0822 2.0890 3.8725 3.8359 3.9464 3.7268 3.8429 4.0226 4.0433 3.9367 4.0008 3.9850 3.8790 1.0037 1.0262 1.0295 1.0087 1.0015 1.0039 1.0005 0.9950 1.0044 1.0028 1.0042 1.0041 1.0062 1.0150 1.0012
dispcorr: -0.018765920 hartree
energy: -2637.030899570186
dipole: 44.16584 -42.64567 1.52017 -11.93573 11.25336 -0.68236 -3.09463 1.69359 -1.40103
magnitude: 2.17702 au
magnitude: 5.53355 debye
