program: Orca
programVersion: 5.0.2
elementType: Cl Cl S S P O O C C C C C C C C C C C H H H H H H H H H H H H H H H
charge: 0
multiplicity: 1
keywords: wb97x-d3
keywords: def2-TZVPP
keywords: def2/J RIJCOSX
keywords: DEFGRID2
keywords: scfconv7
keywords: smallprint printgap noloewdin
keywords: NOSOSCF
formula: C11H15Cl2O2PS2
InChI: InChI=1/C11H15Cl2O2PS2/c1-3-7-18-16(17,14-4-2)15-11-6-5-9(12)8-10(11)13/h5-6,8H,3-4,7H2,1-2H3
33 atoms
Cl -1.433407 -1.74168 -1.843426
Cl -5.414505 0.846815 0.661826
S  2.998118 -0.498642 -0.870211
S  1.19365 0.087174 1.974597
P  1.530852 0.557439 0.143025
O  0.228761 0.398491 -0.83344
O  1.885208 2.071994 -0.213704
C  3.007852 -2.08592 0.035954
C  1.808155 -2.965909 -0.254889
C  1.901858 -4.28674 0.492851
C  -1.065725 0.529472 -0.43657
C  3.162269 2.712214 -0.014867
C  -1.976193 -0.43003 -0.868346
C  -1.514729 1.592399 0.333169
C  3.648149 2.70645 1.412685
C  -3.318593 -0.334156 -0.541202
C  -2.852072 1.694733 0.67678
C  -3.742273 0.728085 0.239417
H  3.109734 -1.868345 1.099635
H  3.934615 -2.561744 -0.291383
H  0.892853 -2.449706 0.038455
H  1.739108 -3.145242 -1.329595
H  2.799372 -4.843185 0.21697
H  1.92579 -4.130728 1.572795
H  1.041047 -4.918002 0.270715
H  3.896681 2.251248 -0.678159
H  3.003398 3.73228 -0.360381
H  -0.826458 2.361373 0.657449
H  2.909125 3.125318 2.094781
H  3.916095 1.709082 1.758614
H  4.544469 3.325587 1.468626
H  -4.016521 -1.08385 -0.887522
H  -3.189097 2.527407 1.27852
elementType: Cl S P O C H
totalener: -2637.00842120 hartree
nucrepener: 2125.56848456 hartree
electener: -4762.57690576 hartree
oneelecener: -7863.44067014 hartree
twoeener: 3100.86376437 hartree
cpcmener: -0.01490319 hartree
kineticenergy: 2631.01094533 hartree
xcener: -154.154052788535 hartree
chargesum: 0.0000000
charge: -0.068680 -0.084794 -0.150765 -0.416081 0.623376 -0.327006 -0.342509 -0.087380 -0.073665 -0.262007 0.223260 0.010935 0.015305 -0.164879 -0.236346 -0.097395 -0.132964 0.055668 0.116594 0.131372 0.031862 0.070607 0.085546 0.083780 0.092877 0.101870 0.109589 0.142383 0.091227 0.080513 0.102027 0.128543 0.147138
qa: -0.0687 -0.0848 -0.1508 -0.4161 0.6234 -0.3270 -0.3425 -0.0874 -0.0737 -0.2620 0.2233 0.0109 0.0153 -0.1649 -0.2363 -0.0974 -0.1330 0.0557 0.1166 0.1314 0.0319 0.0706 0.0855 0.0838 0.0929 0.1019 0.1096 0.1424 0.0912 0.0805 0.1020 0.1285 0.1471
va: 1.2431 1.2163 2.3266 2.0172 5.3746 2.1219 2.1266 3.8532 3.8801 3.9506 3.8238 3.8832 3.9548 3.9583 3.8927 4.0078 3.9974 3.8857 1.0281 1.0046 1.0370 1.0159 1.0018 1.0026 1.0044 0.9942 0.9897 1.0191 1.0074 1.0143 1.0105 1.0164 1.0023
dispcorr: -0.017969318 hartree
energy: -2637.026390520590
dipole: 32.20717 -30.65185 1.55532 -4.97487 5.42467 0.44980 7.86066 -8.03693 -0.17628
magnitude: 1.62862 au
magnitude: 4.13963 debye
