program: Orca
programVersion: 5.0.2
elementType: Cl Cl S S P O O C C C C C C C C C C C H H H H H H H H H H H H H H H
charge: 0
multiplicity: 1
keywords: wb97x-d3
keywords: def2-TZVPP
keywords: def2/J RIJCOSX
keywords: DEFGRID2
keywords: scfconv7
keywords: smallprint printgap noloewdin
keywords: NOSOSCF
formula: C11H15Cl2O2PS2
InChI: InChI=1/C11H15Cl2O2PS2/c1-3-7-18-16(17,14-4-2)15-11-6-5-9(12)8-10(11)13/h5-6,8H,3-4,7H2,1-2H3
33 atoms
Cl -1.431667 -1.77568 1.362225
Cl -5.287578 1.523391 -0.362993
S  3.050487 -0.942056 -0.538471
S  1.238609 0.916393 1.702631
P  1.467088 0.31971 -0.101553
O  0.201508 -0.493975 -0.740194
O  1.664517 1.452229 -1.222133
C  3.147734 -1.951824 0.982598
C  2.233672 -3.163968 0.977846
C  2.550324 -4.164693 -0.121352
C  -1.065225 0.008135 -0.631549
C  2.261848 2.721734 -0.919272
C  -1.942631 -0.51935 0.309715
C  -1.50606 1.005359 -1.487559
C  3.75413 2.629445 -0.696142
C  -3.245442 -0.054651 0.393952
C  -2.804111 1.478353 -1.410755
C  -3.66552 0.945616 -0.465884
H  2.949713 -1.294483 1.830527
H  4.196694 -2.250348 1.036099
H  2.331655 -3.645651 1.955273
H  1.195845 -2.837024 0.902914
H  2.41839 -3.724959 -1.110072
H  3.579134 -4.522611 -0.04959
H  1.895495 -5.033087 -0.057689
H  2.035694 3.345091 -1.783676
H  1.76654 3.155688 -0.047998
H  -0.828376 1.402372 -2.230025
H  3.991624 2.071977 0.209172
H  4.25706 2.152636 -1.536697
H  4.162043 3.634299 -0.583191
H  -3.919877 -0.470639 1.128595
H  -3.141792 2.253917 -2.08302
totalener: -2636.99278401 hartree
nucrepener: 2141.73798755 hartree
electener: -4778.73077157 hartree
oneelecener: -7895.26522812 hartree
twoeener: 3116.53445656 hartree
kineticenergy: 2631.05398826 hartree
xcener: -154.159689834684 hartree
chargesum: -0.0000000
charge: -0.051223 -0.067505 -0.132650 -0.358283 0.596131 -0.325260 -0.347946 -0.136508 -0.081158 -0.244695 0.199124 0.024455 0.031795 -0.140638 -0.236815 -0.104730 -0.120824 0.055761 0.129124 0.112724 0.067817 0.058175 0.083489 0.073574 0.086539 0.092243 0.096324 0.136392 0.086394 0.090011 0.088695 0.116964 0.122505
qa: -0.0512 -0.0675 -0.1327 -0.3583 0.5961 -0.3253 -0.3479 -0.1365 -0.0812 -0.2447 0.1991 0.0245 0.0318 -0.1406 -0.2368 -0.1047 -0.1208 0.0558 0.1291 0.1127 0.0678 0.0582 0.0835 0.0736 0.0865 0.0922 0.0963 0.1364 0.0864 0.0900 0.0887 0.1170 0.1225
va: 1.2543 1.2346 2.3078 2.0919 5.4050 2.1194 2.1095 3.8847 3.8653 3.9380 3.8860 3.8793 4.0047 4.0260 3.9024 4.0175 4.0091 3.9464 1.0405 1.0054 1.0125 1.0440 1.0143 1.0034 1.0072 0.9905 1.0132 1.0114 1.0192 1.0047 1.0131 1.0191 1.0104
dispcorr: -0.018144234 hartree
energy: -2637.010928244832
dipole: 32.88975 -32.12162 0.76813 -5.24334 5.45325 0.20991 -3.55006 3.05349 -0.49657
magnitude: 0.93844 au
magnitude: 2.38533 debye
