program: Orca
programVersion: 5.0.2
elementType: Cl Cl S S P O O C C C C C C C C C C C H H H H H H H H H H H H H H H
charge: 0
multiplicity: 1
keywords: wb97x-d3
keywords: def2-TZVPP
keywords: def2/J RIJCOSX
keywords: DEFGRID2
keywords: scfconv7
keywords: smallprint printgap noloewdin
keywords: NOSOSCF
formula: C11H15Cl2O2PS2
InChI: InChI=1/C11H15Cl2O2PS2/c1-3-7-18-16(17,14-4-2)15-11-6-5-9(12)8-10(11)13/h5-6,8H,3-4,7H2,1-2H3
33 atoms
Cl -1.201106 1.858802 2.052047
Cl -4.832992 0.614141 -1.702522
S  2.261225 -1.614872 -1.033289
S  3.081529 0.409066 1.600046
P  1.837069 -0.005034 0.214232
O  0.353764 -0.283408 0.868605
O  1.552482 1.062248 -0.937384
C  3.037627 -2.753193 0.167746
C  2.099066 -3.356644 1.198819
C  0.939836 -4.140843 0.608884
C  -0.826857 -0.082599 0.22355
C  1.436897 2.467336 -0.641227
C  -1.684114 0.901651 0.707835
C  -1.222289 -0.843339 -0.866573
C  0.452575 3.075718 -1.608971
C  -2.921322 1.11713 0.122271
C  -2.451987 -0.631409 -1.46534
C  -3.295394 0.348001 -0.966842
H  3.857565 -2.214431 0.643486
H  3.473153 -3.528813 -0.465744
H  2.705871 -4.016155 1.825966
H  1.730871 -2.573623 1.864168
H  1.289777 -4.93497 -0.052897
H  0.346032 -4.603931 1.396043
H  0.273095 -3.500209 0.032578
H  1.111551 2.621006 0.390098
H  2.427263 2.913568 -0.742622
H  -0.564068 -1.611881 -1.248177
H  0.375923 4.146789 -1.421917
H  0.77082 2.936954 -2.641419
H  -0.540032 2.641444 -1.491695
H  -3.578913 1.880153 0.513735
H  -2.751563 -1.229561 -2.313946
totalener: -2636.98958917 hartree
nucrepener: 2163.85161429 hartree
electener: -4800.84120347 hartree
oneelecener: -7938.97467154 hartree
twoeener: 3138.13346808 hartree
kineticenergy: 2631.04921637 hartree
xcener: -154.159036983595 hartree
chargesum: -0.0000000
charge: -0.044395 -0.065310 -0.133150 -0.341773 0.575116 -0.316035 -0.315100 -0.139275 -0.109575 -0.234007 0.209781 -0.028957 -0.023141 -0.097922 -0.212160 -0.095748 -0.152715 0.066645 0.132654 0.115379 0.074397 0.072308 0.076733 0.092094 0.068329 0.101680 0.117947 0.113427 0.084350 0.091870 0.074747 0.117643 0.124165
qa: -0.0444 -0.0653 -0.1331 -0.3418 0.5751 -0.3160 -0.3151 -0.1393 -0.1096 -0.2340 0.2098 -0.0290 -0.0231 -0.0979 -0.2122 -0.0957 -0.1527 0.0666 0.1327 0.1154 0.0744 0.0723 0.0767 0.0921 0.0683 0.1017 0.1179 0.1134 0.0843 0.0919 0.0747 0.1176 0.1242
va: 1.2705 1.2363 2.2917 2.1284 5.4080 2.0905 2.1022 3.8964 3.8599 3.9428 3.8368 3.8829 3.9611 3.9592 3.9292 3.9936 4.0884 3.9419 1.0285 1.0060 1.0083 1.0296 1.0044 1.0083 1.0056 1.0067 1.0046 1.0348 1.0106 1.0062 1.0113 1.0228 1.0123
dispcorr: -0.020038782 hartree
energy: -2637.009627956982
dipole: 16.50724 -16.71832 -0.21108 -13.75847 13.38985 -0.36862 -4.22414 3.56534 -0.65880
magnitude: 0.78387 au
magnitude: 1.99244 debye
