program: Gaussian 09
title: 000005983
version: EM64L-G09RevD.01
frameworkgroup: C1[X(C15H21N3O2)]
method: RPBEPBE
basis: SDD
operation: Freq
keyword: #p
keyword: freq=noraman
keyword: PBEPBE/SDD
title: #p freq=noraman PBEPBE/SDD
converged: YES YES NO NO
title: Mulliken charges:
elementType: O O N N N C C C C C C C C C C C C C C C H H H H H H H H H H H H H H H H H H H H H
charge: -0.346970 -0.272676 -0.066026 -0.146804 -0.376081 0.190658 -0.222515 -0.480162 0.308855 -0.412419 0.261908 -0.787435 -0.637219 -0.530179 -0.652240 -0.363917 0.369273 -0.406806 0.272462 -0.605902 0.222848 0.222965 0.247704 0.235206 0.181326 0.221789 0.230364 0.216125 0.228745 0.228208 0.195695 0.271030 0.224578 0.214183 0.240254 0.225466 0.243356 0.328778 0.226626 0.228015 0.270933
chargesum: 0.00000
title: Mulliken charges with hydrogens summed into heavy atoms:
elementType: O O N N N C C C C C C C C C C C C C C C
charge: -0.346970 -0.272676 -0.066026 -0.146804 -0.047303 0.190658 0.000333 -0.009492 0.308855 0.004114 0.261908 -0.119157 0.015429 -0.259149 0.026775 -0.138452 0.369273 -0.163450 0.272462 0.119671
polarizability: 2.81068650e+02 -2.55986017e-01 1.84270355e+02 2.78920891e+00 -3.65601351e+00 1.22111664e+02
1716.lowfreq: -20.7716 -12.0948 -0.0010 -0.0007 -0.0005 1.8982 3.8044 18.3643 38.6899
frequency: -18.0306 17.3144 38.6301 55.8421 71.3153 94.8654 104.1817 111.3911 122.7219 147.9597 166.8372 185.8621 192.2352 223.9885 226.1800 238.1275 251.4812 276.3259 301.4952 309.0591 332.2364 355.3198 364.4200 380.5293 444.7278 467.9387 514.9108 539.8339 575.0529 580.0291 591.9131 606.5850 641.5344 677.8116 688.3427 723.1953 743.8752 761.8294 794.2414 807.2521 835.5174 867.6158 883.6073 898.7037 917.0714 920.9849 925.7714 962.7684 984.6640 1016.0952 1037.4414 1053.0379 1084.6010 1099.6444 1105.3013 1109.9171 1118.0625 1126.3392 1127.6741 1138.9572 1143.9738 1156.4113 1176.8857 1177.5409 1193.9741 1201.1165 1211.5656 1227.5980 1248.5716 1275.7183 1293.9986 1309.5802 1334.3592 1345.8015 1363.3539 1387.1929 1404.7569 1429.4025 1433.5925 1435.5909 1442.6238 1458.8794 1460.3891 1463.7058 1470.0792 1471.5958 1475.6539 1476.7253 1484.2701 1488.4780 1499.0423 1512.0150 1518.3160 1598.7877 1629.9970 1685.4867 2857.3725 2857.7224 2871.0572 2941.0194 2974.3654 2976.9000 3007.1603 3012.8285 3022.4284 3027.0150 3053.2242 3066.4817 3073.2277 3078.1226 3078.7361 3089.1217 3110.2781 3139.3636 3164.3896 3174.0958 3578.1497
redmass: 3.0426 4.8135 4.0860 4.0999 2.8785 1.9431 1.1350 1.6462 3.6004 3.0975 1.7506 1.5985 3.7083 3.7710 1.1735 2.0204 2.4374 3.5653 3.1826 2.7531 3.3908 4.7178 4.2699 5.4400 3.4066 3.3128 3.4205 5.6885 1.6347 1.8863 3.4464 4.4369 4.9269 5.3629 11.2496 3.8382 3.9320 3.4796 1.5828 2.6336 5.0058 2.7328 1.6434 2.6303 1.8932 1.4393 2.2034 2.2589 2.1926 1.8256 2.0661 2.3774 4.4635 1.3705 1.6057 1.4406 1.7836 1.2845 1.9516 1.8253 1.7076 1.5976 2.1659 2.4464 1.9891 2.1973 3.4944 1.8360 2.6757 1.4570 1.7917 1.7504 1.3715 1.4261 5.1534 1.2059 2.9405 1.1655 1.2839 1.2576 2.6003 1.0902 1.4213 1.0609 1.0551 1.0632 1.0925 1.0637 1.0446 1.2513 1.0874 1.4958 2.2392 7.6211 7.3264 9.3186 1.0763 1.0626 1.0725 1.0371 1.0357 1.0355 1.0993 1.0771 1.0731 1.0719 1.1026 1.0991 1.0967 1.1002 1.1000 1.1050 1.0979 1.0880 1.0960 1.0927 1.0772
irintensity: 0.0273 1.3410 9.3505 2.9311 0.8082 1.1162 0.0798 0.4213 2.8484 1.5938 0.6481 2.1742 0.3385 1.7391 0.7608 1.9902 0.5892 2.0064 8.7631 6.4464 3.9440 15.0324 1.8253 0.7803 4.5049 5.4415 3.1122 1.2768 57.2497 83.8215 8.9210 1.0040 2.4257 2.5752 24.0193 5.8193 3.8891 1.8370 49.9469 17.0182 11.3008 15.7109 9.2399 35.2039 17.9449 4.8851 34.2312 9.5041 64.4773 21.0544 89.8148 21.6534 214.0828 18.7426 1.6222 10.7082 87.3202 1.3779 97.7742 30.0051 81.7583 104.0987 204.4841 74.8645 84.7331 106.0091 20.5227 15.1419 17.3766 45.7071 9.7830 0.5601 13.4159 17.6743 9.1650 14.4638 5.1756 29.8481 124.8910 32.7925 109.8172 5.8704 154.6379 10.9488 19.7796 2.6223 0.2434 13.2760 14.4339 57.4546 5.9850 317.1943 29.9824 26.5065 57.6524 251.8711 52.0300 38.0739 252.7708 133.4005 35.2759 101.9721 41.2307 21.6423 50.2261 45.7739 39.8068 31.7824 35.7963 3.6455 34.6619 30.1587 4.2933 17.8877 12.8009 0.7932 43.0480
temp: 298.150 k
press: 1.00000 atm
elementType: 8 8 7 7 7 6 6 6 6 6 6 6 6 6 6 6 6 6 6 6 1 1 1 1 1 1 1 1 1 1 1 1 1 1 1 1 1 1 1 1 1
symmnumber: 1
zpe: 891105.8 jmol-1
zpe.correction: 0.339404 hartree
zpe.thermalcorrener: 0.359138 hartree
zpe.thermalcorrenthalpy: 0.360082 hartree
zpe.thermalcorrgfe: 0.290468 hartree
zpe.sumelectzpe: -897.390047 hartree
zpe.sumelectthermal: -897.370313 hartree
zpe.sumelectthermalent: -897.369369 hartree
zpe.sumelectthermalfe: -897.438983 hartree
dipole: -0.7914 0.5655 1.2725
dipole: 1.6017
quadrupole: -83.5267 -113.0488 -123.0921
quadrupole: 2.5772 1.4958 -2.9865
quadrupole: 23.0292 -6.4930 -16.5363 2.5772 1.4958 -2.9865
hfenergy: -897.729451 hartree
pointgroup: C01 [X(C15H21N3O2)]
dipole: -0.3179996 0.2969074 0.4558754 debye
polarizability: 280.4220205|-3.7349995|182.5614182|8.8464343|-11.5572483|124.4672305 unknown
InChI: InChI=1S/C15H21N3O2/c1-15-7-8-17(3)13(15)18(4)12-6-5-10(9-11(12)15)20-14(19)16-2/h5-6,9,13,16H,7-8H2,1-4H3
charge 0 multiplicity 1
41 atoms
O  3.30533 0.708127 0.258382
O  3.434367 -1.572558 -0.433365
N  -3.712143 -0.581856 -0.706471
N  -2.253728 1.390798 -0.198854
N  5.312565 -0.320674 0.227473
C  -1.592855 -0.829606 0.518024
C  -2.838388 0.110207 0.272902
C  -1.728486 -1.889146 -0.633943
C  -0.397283 0.091367 0.29617
C  -3.244424 -1.981584 -0.879621
C  -0.857852 1.350881 -0.193397
C  -1.626604 -1.495855 1.910713
C  -5.163207 -0.431297 -0.519778
C  0.967896 -0.177236 0.443286
C  -3.083257 2.479366 -0.687037
C  0.070261 2.352156 -0.570085
C  1.889188 0.836238 0.072782
C  1.452249 2.078152 -0.428362
C  3.972932 -0.513775 -0.028351
C  6.300195 -1.385486 0.046541
H  -3.411279 0.310902 1.211478
H  -1.278809 -2.8577 -0.35542
H  -1.220369 -1.517947 -1.5404
H  -3.488432 -2.351908 -1.8928
H  -3.725486 -2.673665 -0.143346
H  -0.737784 -2.135838 2.059083
H  -1.634874 -0.736483 2.713153
H  -2.524867 -2.131054 2.026972
H  -5.694353 -0.879019 -1.379213
H  -5.440103 0.636365 -0.478855
H  -5.543553 -0.923876 0.410501
H  1.325238 -1.145333 0.802263
H  -2.508063 3.421251 -0.701338
H  -3.952164 2.629781 -0.015238
H  -3.469397 2.289206 -1.70974
H  -0.25322 3.319267 -0.967571
H  2.199926 2.828549 -0.704235
H  5.59669 0.606186 0.54466
H  6.816633 -1.622194 0.995591
H  7.05551 -1.110338 -0.713066
H  5.767201 -2.285571 -0.298991
