program: Orca
programVersion: 5.0.2
elementType: Cl Cl S S P O O C C C C C C C C C C C H H H H H H H H H H H H H H H
charge: 0
multiplicity: 1
keywords: wb97x-d3
keywords: def2-TZVPP
keywords: def2/J RIJCOSX
keywords: DEFGRID2
keywords: scfconv7
keywords: smallprint printgap noloewdin
keywords: NOSOSCF
formula: C11H15Cl2O2PS2
InChI: InChI=1/C11H15Cl2O2PS2/c1-3-7-18-16(17,14-4-2)15-11-6-5-9(12)8-10(11)13/h5-6,8H,3-4,7H2,1-2H3
33 atoms
Cl -0.683447 -0.76607 -2.270213
Cl -4.854947 2.164608 -0.594663
S  2.552644 -2.00469 0.98557
S  1.356806 0.532021 2.72634
P  1.307959 -0.365959 1.036801
O  -0.115734 -1.055742 0.603573
O  1.610062 0.534893 -0.253981
C  2.245064 -2.768363 -0.654553
C  2.95265 -2.102801 -1.822322
C  4.461836 -2.02216 -1.662038
C  -1.202724 -0.278305 0.332209
C  1.939363 1.931048 -0.186762
C  -1.591751 -0.070617 -0.986235
C  -1.949233 0.275983 1.360571
C  0.698221 2.791101 -0.225942
C  -2.719971 0.679463 -1.277075
C  -3.075539 1.030444 1.08165
C  -3.450473 1.229966 -0.236984
H  1.170152 -2.832707 -0.815087
H  2.609385 -3.789085 -0.517007
H  2.708162 -2.689628 -2.7132
H  2.534748 -1.110379 -1.990312
H  4.899989 -3.010097 -1.509907
H  4.924488 -1.589891 -2.548629
H  4.738738 -1.402972 -0.809369
H  2.521815 2.1332 0.714525
H  2.575955 2.115202 -1.051898
H  -1.645508 0.103667 2.383585
H  0.093098 2.579439 -1.107516
H  0.085022 2.640911 0.662595
H  0.985324 3.842891 -0.258251
H  -3.020482 0.830566 -2.303994
H  -3.656972 1.457759 1.885847
totalener: -2636.99136313 hartree
nucrepener: 2175.75261129 hartree
electener: -4812.74397443 hartree
oneelecener: -7962.88347010 hartree
twoeener: 3150.13949567 hartree
kineticenergy: 2631.05084290 hartree
xcener: -154.160528301772 hartree
chargesum: 0.0000000
charge: -0.060243 -0.064862 -0.109318 -0.363259 0.575141 -0.333572 -0.318043 -0.155402 -0.096310 -0.240322 0.247763 0.024970 0.008339 -0.172901 -0.234660 -0.116951 -0.112524 0.062981 0.122420 0.120006 0.073850 0.059778 0.076543 0.085909 0.079866 0.096165 0.092326 0.139836 0.086445 0.085026 0.095531 0.118649 0.126821
qa: -0.0602 -0.0649 -0.1093 -0.3633 0.5751 -0.3336 -0.3180 -0.1554 -0.0963 -0.2403 0.2478 0.0250 0.0083 -0.1729 -0.2347 -0.1170 -0.1125 0.0630 0.1224 0.1200 0.0739 0.0598 0.0765 0.0859 0.0799 0.0962 0.0923 0.1398 0.0864 0.0850 0.0955 0.1186 0.1268
va: 1.2486 1.2371 2.3254 2.0930 5.4149 2.0959 2.0818 3.9087 3.8695 3.9397 3.7882 3.8720 3.9709 4.0419 3.9043 4.0069 4.0118 3.9428 1.0287 1.0063 1.0069 1.0256 1.0039 1.0064 1.0175 1.0168 0.9926 1.0111 1.0038 1.0169 1.0161 1.0192 1.0092
dispcorr: -0.020499106 hartree
energy: -2637.011862238793
dipole: 26.52568 -26.35797 0.16771 -1.89860 1.98098 0.08238 -6.35433 5.29986 -1.05447
magnitude: 1.07090 au
magnitude: 2.72200 debye
