program: Orca
programVersion: 5.0.2
elementType: Cl Cl S S P O O C C C C C C C C C C C H H H H H H H H H H H H H H H
charge: 0
multiplicity: 1
keywords: wb97x-d3
keywords: def2-TZVPP
keywords: def2/J RIJCOSX
keywords: DEFGRID2
keywords: scfconv7
keywords: smallprint printgap noloewdin
keywords: NOSOSCF
formula: C11H15Cl2O2PS2
InChI: InChI=1/C11H15Cl2O2PS2/c1-3-7-18-16(17,14-4-2)15-11-6-5-9(12)8-10(11)13/h5-6,8H,3-4,7H2,1-2H3
33 atoms
Cl -0.482702 -1.04136 -2.088784
Cl -4.794832 1.89008 -0.832191
S  2.804354 -1.608597 1.256568
S  1.392678 0.988811 2.748428
P  1.429498 -0.078939 1.160055
O  0.068802 -0.927941 0.804454
O  1.65841 0.709797 -0.214919
C  2.494324 -2.618968 -0.239234
C  3.122761 -2.077888 -1.51091
C  2.919746 -3.045667 -2.669659
C  -1.059591 -0.260254 0.430607
C  1.821932 2.131112 -0.319366
C  -1.440637 -0.239708 -0.906364
C  -1.846896 0.380934 1.374968
C  0.499612 2.816207 -0.572975
C  -2.596458 0.415906 -1.298204
C  -3.000093 1.044415 0.994079
C  -3.363156 1.062051 -0.342994
H  1.421659 -2.772099 -0.348018
H  2.928222 -3.586706 0.022532
H  2.68446 -1.110523 -1.754547
H  4.188599 -1.907137 -1.346034
H  1.859767 -3.223824 -2.857852
H  3.355294 -2.653438 -3.588092
H  3.385491 -4.01233 -2.471149
H  2.293943 2.519765 0.585099
H  2.50866 2.280738 -1.152388
H  -1.54885 0.354321 2.41388
H  -0.173072 2.710312 0.278183
H  0.666935 3.881887 -0.734114
H  0.006469 2.416335 -1.458585
H  -2.88875 0.424244 -2.338506
H  -3.608967 1.544407 1.733632
totalener: -2636.99161060 hartree
nucrepener: 2178.52031695 hartree
electener: -4815.51192755 hartree
oneelecener: -7968.33110683 hartree
twoeener: 3152.81917928 hartree
kineticenergy: 2631.04680254 hartree
xcener: -154.159509283911 hartree
chargesum: -0.0000000
charge: -0.062674 -0.064419 -0.108034 -0.362337 0.571448 -0.338566 -0.313570 -0.126772 -0.113718 -0.237457 0.238403 0.025912 0.022486 -0.169625 -0.236720 -0.122120 -0.120595 0.068743 0.109439 0.117395 0.068185 0.072082 0.071424 0.089050 0.079485 0.094665 0.092219 0.141291 0.084726 0.096856 0.086921 0.118692 0.127184
qa: -0.0627 -0.0644 -0.1080 -0.3623 0.5714 -0.3386 -0.3136 -0.1268 -0.1137 -0.2375 0.2384 0.0259 0.0225 -0.1696 -0.2367 -0.1221 -0.1206 0.0687 0.1094 0.1174 0.0682 0.0721 0.0714 0.0891 0.0795 0.0947 0.0922 0.1413 0.0847 0.0969 0.0869 0.1187 0.1272
va: 1.2497 1.2375 2.3383 2.0933 5.4165 2.0928 2.0871 3.8915 3.8867 3.9397 3.8012 3.8746 3.9640 4.0436 3.9083 4.0089 4.0168 3.9334 1.0297 1.0082 1.0251 1.0179 1.0063 1.0067 1.0039 1.0186 0.9924 1.0114 1.0128 1.0161 1.0037 1.0195 1.0093
dispcorr: -0.020738603 hartree
energy: -2637.012349203569
dipole: 21.51685 -21.41422 0.10263 -3.88562 3.85588 -0.02974 -9.32257 8.24757 -1.07500
magnitude: 1.08030 au
magnitude: 2.74590 debye
