program: Orca
programVersion: 5.0.2
elementType: Cl Cl S S P O O C C C C C C C C C C C H H H H H H H H H H H H H H H
charge: 0
multiplicity: 1
keywords: wb97x-d3
keywords: def2-TZVPP
keywords: def2/J RIJCOSX
keywords: DEFGRID2
keywords: scfconv7
keywords: smallprint printgap noloewdin
keywords: NOSOSCF
formula: C11H15Cl2O2PS2
InChI: InChI=1/C11H15Cl2O2PS2/c1-3-7-18-16(17,14-4-2)15-11-6-5-9(12)8-10(11)13/h5-6,8H,3-4,7H2,1-2H3
33 atoms
Cl -1.918326 -1.916744 -0.907779
Cl -5.471326 1.843013 0.533536
S  2.512959 -1.060296 -0.986695
S  0.616315 -0.541833 1.823909
P  1.16769 0.077835 0.100155
O  -0.030748 0.312586 -0.978965
O  1.857702 1.525844 0.031417
C  2.120413 -2.751865 -0.39611
C  3.023041 -3.20823 0.735413
C  4.492814 -3.281457 0.354852
C  -1.282018 0.67833 -0.581125
C  2.939377 1.835765 0.920722
C  -2.285085 -0.28153 -0.528036
C  -1.576947 1.99542 -0.272433
C  3.329367 3.277876 0.710902
C  -3.579436 0.074244 -0.187905
C  -2.865812 2.362961 0.07191
C  -3.858843 1.397156 0.11174
H  2.234957 -3.384387 -1.277984
H  1.070457 -2.782149 -0.106857
H  2.878324 -2.549637 1.593435
H  2.674165 -4.197159 1.047319
H  4.883855 -2.302323 0.076219
H  5.092374 -3.647768 1.187616
H  4.654262 -3.955711 -0.488076
H  2.623562 1.659601 1.951946
H  3.782333 1.1706 0.711982
H  -0.790528 2.736983 -0.316162
H  3.658677 3.458562 -0.311391
H  2.499773 3.94846 0.931759
H  4.151736 3.532098 1.379486
H  -4.356194 -0.67596 -0.152211
H  -3.094525 3.392287 0.307974
totalener: -2636.99314839 hartree
nucrepener: 2115.37295639 hartree
electener: -4752.36610478 hartree
oneelecener: -7842.48208380 hartree
twoeener: 3090.11597903 hartree
kineticenergy: 2631.05791347 hartree
xcener: -154.157973210717 hartree
chargesum: 0.0000000
charge: -0.055265 -0.068534 -0.137050 -0.361861 0.596116 -0.321458 -0.327422 -0.103495 -0.099462 -0.237241 0.186442 0.024671 0.036136 -0.125453 -0.232343 -0.106839 -0.119449 0.059753 0.116865 0.102881 0.069321 0.066628 0.073101 0.087159 0.074658 0.095991 0.085189 0.133617 0.087745 0.082491 0.079226 0.115998 0.121882
qa: -0.0553 -0.0685 -0.1370 -0.3619 0.5961 -0.3215 -0.3274 -0.1035 -0.0995 -0.2372 0.1864 0.0247 0.0361 -0.1255 -0.2323 -0.1068 -0.1194 0.0598 0.1169 0.1029 0.0693 0.0666 0.0731 0.0872 0.0747 0.0960 0.0852 0.1336 0.0877 0.0825 0.0792 0.1160 0.1219
va: 1.2568 1.2333 2.3068 2.0801 5.4246 2.1405 2.1300 3.8672 3.9111 3.9238 3.8951 3.8687 3.9949 4.0327 3.9658 4.0301 4.0205 3.9427 1.0097 1.0457 1.0313 1.0107 1.0189 1.0067 1.0032 1.0061 0.9967 1.0099 1.0051 1.0058 1.0082 1.0199 1.0105
dispcorr: -0.017181992 hartree
energy: -2637.010330381773
dipole: 40.57393 -39.54165 1.03228 -3.25381 3.50314 0.24933 5.91771 -5.94603 -0.02833
magnitude: 1.06234 au
magnitude: 2.70026 debye
