program: Orca
programVersion: 5.0.2
elementType: Cl Cl S S P O O C C C C C C C C C C C H H H H H H H H H H H H H H H
charge: 0
multiplicity: 1
keywords: wb97x-d3
keywords: def2-TZVPP
keywords: def2/J RIJCOSX
keywords: DEFGRID2
keywords: scfconv7
keywords: smallprint printgap noloewdin
keywords: NOSOSCF
formula: C11H15Cl2O2PS2
InChI: InChI=1/C11H15Cl2O2PS2/c1-3-7-18-16(17,14-4-2)15-11-6-5-9(12)8-10(11)13/h5-6,8H,3-4,7H2,1-2H3
33 atoms
Cl -0.920344 1.567766 -2.397065
Cl -5.374716 1.098519 0.557383
S  2.974788 -0.740445 -0.89389
S  1.354652 -0.591834 2.101949
P  1.389301 -0.062646 0.254518
O  0.117065 -0.548508 -0.644812
O  1.369825 1.504451 -0.050381
C  3.332175 -2.334165 -0.077703
C  2.315332 -3.422051 -0.3730
C  2.715398 -4.741955 0.271653
C  -1.152841 -0.148924 -0.331767
C  1.867702 2.476962 0.879294
C  -1.766803 0.839167 -1.093953
C  -1.85273 -0.74925 0.702705
C  3.376239 2.475303 0.972816
C  -3.071195 1.222583 -0.824828
C  -3.154189 -0.370312 0.982178
C  -3.752618 0.617788 0.218076
H  3.427429 -2.152534 0.993793
H  4.319614 -2.606718 -0.456166
H  1.336604 -3.116513 0.001728
H  2.211689 -3.540956 -1.45312
H  3.682678 -5.091321 -0.092742
H  2.783314 -4.647958 1.356288
H  1.983087 -5.518972 0.05443
H  1.499241 3.429409 0.500917
H  1.418392 2.302698 1.859273
H  -1.372421 -1.520289 1.288291
H  3.749724 1.552355 1.415657
H  3.839063 2.601878 -0.005166
H  3.697426 3.301023 1.608399
H  -3.543671 1.987316 -1.424448
H  -3.69602 -0.840637 1.789987
totalener: -2636.99280657 hartree
nucrepener: 2127.60510196 hartree
electener: -4764.59790853 hartree
oneelecener: -7866.95376109 hartree
twoeener: 3102.35585256 hartree
kineticenergy: 2631.05909112 hartree
xcener: -154.159572287861 hartree
chargesum: 0.0000000
charge: -0.048001 -0.068929 -0.121982 -0.382927 0.603830 -0.327709 -0.330722 -0.113676 -0.085628 -0.247849 0.240400 0.019517 -0.010956 -0.148848 -0.239561 -0.097490 -0.118294 0.051417 0.114577 0.113861 0.058589 0.069919 0.074338 0.082848 0.088396 0.096763 0.095441 0.128182 0.085705 0.092061 0.087834 0.115085 0.123808
qa: -0.0480 -0.0689 -0.1220 -0.3829 0.6038 -0.3277 -0.3307 -0.1137 -0.0856 -0.2478 0.2404 0.0195 -0.0110 -0.1488 -0.2396 -0.0975 -0.1183 0.0514 0.1146 0.1139 0.0586 0.0699 0.0743 0.0828 0.0884 0.0968 0.0954 0.1282 0.0857 0.0921 0.0878 0.1151 0.1238
va: 1.2625 1.2333 2.3236 2.0610 5.3904 2.1179 2.1398 3.8843 3.8776 3.9463 3.8375 3.8933 4.0460 4.0304 3.9007 4.0104 4.0183 3.9424 1.0337 1.0072 1.0267 1.0182 1.0038 1.0039 1.0062 0.9916 1.0112 1.0156 1.0174 1.0048 1.0133 1.0218 1.0108
dispcorr: -0.017490735 hartree
energy: -2637.010297302773
dipole: 31.04876 -30.34687 0.70189 -16.52076 16.37397 -0.14679 9.36532 -9.22058 0.14474
magnitude: 0.73154 au
magnitude: 1.85942 debye
