program: Gaussian 09
title: 000066499
version: EM64L-G09RevD.01
frameworkgroup: C1[X(C21H14ClNO4S)]
method: RPBEPBE
basis: SDD
operation: Freq
keyword: #p
keyword: freq=noraman
keyword: PBEPBE/SDD
title: #p freq=noraman PBEPBE/SDD
converged: YES YES NO NO
title: Mulliken charges:
elementType: Cl S O O O O N C C C C C C C C C C C C C C C C C C C C C H H H H H H H H H H H H H H
charge: 0.019080 0.995728 -0.295420 -0.167739 -0.512510 -0.511814 -0.752293 0.042891 0.331868 0.415984 0.267561 0.373931 -0.083695 -0.205714 -0.430601 -0.357878 -0.028243 -0.221348 -0.386772 -0.298315 -0.220907 -0.231159 -0.238220 -0.242999 0.450947 -0.361403 -0.369266 -0.796505 0.420689 0.296478 0.269656 0.240999 0.302780 0.248502 0.285129 0.279120 0.267468 0.247195 0.246527 0.245294 0.232657 0.232314
chargesum: 0.00000
title: Mulliken charges with hydrogens summed into heavy atoms:
elementType: Cl S O O O O N C C C C C C C C C C C C C C C C C C C C C
charge: 0.019080 0.995728 -0.295420 -0.167739 -0.512510 -0.511814 -0.331603 0.042891 0.331868 0.415984 0.267561 0.373931 -0.083695 -0.205714 -0.134123 -0.088222 -0.028243 0.019651 -0.083992 -0.298315 0.027595 0.036309 0.046909 0.036121 0.450947 -0.114209 -0.122739 -0.086239
polarizability: 4.44037717e+02 2.01585567e+01 3.09864875e+02 -2.34070004e+01 -1.52715314e+01 1.99758912e+02
1716.lowfreq: -50.2284 -9.7167 -2.7872 -1.3227 0.0010 0.0015 0.0021 10.0396 13.7146
frequency: -50.1947 6.6975 12.7514 30.5315 36.7589 46.2815 68.3550 88.6016 105.4463 131.5762 139.6075 167.1505 172.8313 181.4863 189.9883 218.0210 221.8819 231.3426 270.7631 282.1526 297.6440 310.6051 343.0259 352.9080 381.0922 383.3401 395.9448 406.9599 418.9659 421.5574 427.4104 458.9776 473.4134 476.6453 505.8553 507.4728 546.5531 578.7110 595.8137 608.2844 621.1008 636.5091 661.6620 685.9324 706.5644 711.5267 726.2201 758.5824 775.9599 790.4390 792.8311 804.9749 821.3736 826.0263 842.1745 848.3238 869.1282 877.7991 915.0209 937.4581 945.1147 953.0408 961.3378 980.8050 990.4751 992.3594 1001.5417 1006.9286 1013.7326 1049.1724 1051.7951 1066.5341 1078.6185 1116.0102 1121.3973 1159.1424 1182.3250 1186.5129 1194.3457 1206.1684 1219.7621 1226.9189 1273.7512 1298.2377 1318.2449 1354.6036 1374.2567 1381.9001 1391.9129 1398.8631 1398.9001 1416.4529 1437.2386 1440.1529 1451.9773 1469.8942 1472.6586 1473.0969 1513.3007 1542.3511 1564.2301 1566.7438 1593.7923 1594.6929 1595.5228 1611.6087 2982.1387 3026.5846 3065.0170 3094.6008 3138.3755 3139.7390 3144.4926 3150.6808 3162.6440 3165.8052 3169.8622 3170.7069 3178.1291 3180.1002
redmass: 1.0112 5.6971 6.7272 10.1031 4.5953 5.9956 7.1670 10.4458 5.4069 6.6053 7.9636 8.6034 9.6719 7.4857 4.6894 6.2324 8.2340 8.0492 6.6172 7.8456 5.4237 5.2061 7.7042 8.1193 3.9168 7.6497 8.9079 2.8760 6.0361 9.4458 11.7124 8.0537 9.1405 4.1241 3.1751 5.2164 4.4786 5.8196 7.4851 8.0846 6.9108 5.6351 4.5014 6.6194 3.2801 2.7760 8.0305 4.5325 5.0991 1.9590 4.1008 3.6921 1.7731 1.4122 1.2680 1.3006 4.1889 5.2657 6.7431 1.4589 1.4413 9.1728 1.3177 1.3896 1.4847 4.9141 1.3737 1.3664 4.8561 1.5973 2.4551 2.2871 2.0876 3.5717 1.2872 1.7033 1.4706 1.1519 1.7204 1.2932 3.0173 1.7993 2.8227 1.2621 3.1980 3.4246 10.2329 6.2518 2.9631 1.3861 4.2505 3.3796 3.1902 3.5211 2.7685 1.1265 1.1172 2.0268 4.4318 7.2403 6.3811 6.8345 6.0407 7.3255 6.9626 7.4383 1.0390 1.0842 1.0947 1.1002 1.0890 1.0892 1.0883 1.0877 1.0956 1.0967 1.0925 1.0920 1.0979 1.0994
irintensity: 0.5315 0.6061 0.9489 1.8035 0.3550 3.6175 0.3876 1.8123 0.7280 1.4500 0.6409 1.9113 1.1656 0.5900 0.2068 8.8362 0.6106 4.7281 7.1131 0.8210 4.8630 7.7638 0.2817 3.6351 0.8939 21.3374 30.4851 0.2565 33.5431 58.2895 78.3661 54.5805 6.8675 3.2581 110.3228 7.4784 1.7292 8.2269 8.6054 123.0082 1.5462 46.3634 0.9019 8.6271 4.3004 47.1885 94.1500 3.4673 15.3838 23.5684 7.5656 84.8001 138.6466 21.1719 68.3434 39.1122 2.0967 43.9296 6.2952 3.8873 0.4757 59.3029 2.7629 0.5201 2.9884 3.8009 2.3581 1.8114 17.8622 16.1662 33.3830 11.6994 2.4469 45.7677 8.8552 21.7277 10.3870 12.9064 4.7642 23.7053 8.3824 48.4386 275.0542 2.8603 661.2454 68.2346 9.4234 0.3405 10.3151 15.4849 8.9405 47.5628 11.5212 12.5727 223.8846 16.0977 18.3007 17.4906 47.8750 209.9564 47.3506 121.3617 10.1610 24.6113 1.0058 41.4902 21.7817 346.5418 19.8156 13.1469 10.7333 6.9985 10.3904 5.5241 0.6682 7.9878 0.2509 1.2734 7.0831 10.4240
temp: 298.150 k
press: 1.00000 atm
elementType: 17 16 8 8 8 8 7 6 6 6 6 6 6 6 6 6 6 6 6 6 6 6 6 6 6 6 6 6 1 1 1 1 1 1 1 1 1 1 1 1 1 1
symmnumber: 1
zpe: 774643.7 jmol-1
zpe.correction: 0.295046 hartree
zpe.thermalcorrener: 0.318893 hartree
zpe.thermalcorrenthalpy: 0.319837 hartree
zpe.thermalcorrgfe: 0.237983 hartree
zpe.sumelectzpe: -2020.322000 hartree
zpe.sumelectthermal: -2020.298153 hartree
zpe.sumelectthermalent: -2020.297209 hartree
zpe.sumelectthermalfe: -2020.379063 hartree
dipole: 2.2238 0.3554 5.8583
dipole: 6.2763
quadrupole: -160.9175 -169.8651 -180.3287
quadrupole: 32.0175 25.5207 -11.3716
quadrupole: 9.4529 0.5054 -9.9583 32.0175 25.5207 -11.3716
hfenergy: -2020.6170457 hartree
pointgroup: C01 [X(C21H14Cl1N1O4S1)]
dipole: -0.0130975 -1.9824947 -1.4720282 debye
polarizability: 428.8012709|37.7296302|249.1394044|56.0291918|-46.7748253|275.7208287 unknown
InChI: InChI=1S/C21H14ClNO4S/c1-12-8-10-13(11-9-12)28(26,27)23-17-7-3-5-15-19(17)21(25)14-4-2-6-16(22)18(14)20(15)24/h2-11,23H,1H3
charge 0 multiplicity 1
42 atoms
Cl 6.573209 1.690279 0.096035
S  -3.086941 0.090109 1.011825
O  0.827166 -0.521127 2.292017
O  4.043511 2.363637 -1.1391
O  -3.382623 -0.62565 2.434235
O  -3.77778 1.498627 0.58187
N  -1.251873 0.251595 1.043802
C  0.979321 0.977538 0.409621
C  1.831271 1.729487 -0.459801
C  -0.458249 1.024046 0.21418
C  3.043211 0.163891 1.666203
C  3.917781 0.904557 0.801105
C  1.559869 0.17687 1.483585
C  3.328738 1.710668 -0.318785
C  1.28453 2.516085 -1.490408
C  -0.985846 1.851904 -0.825961
C  -3.396512 -1.152012 -0.375909
C  -0.120003 2.576255 -1.657585
C  3.552238 -0.611987 2.733214
C  5.313393 0.821115 1.070475
C  4.938241 -0.671608 2.968332
C  5.821362 0.046679 2.135676
C  -3.197289 -2.512594 -0.091538
C  -3.850388 -0.673782 -1.614183
C  -3.889715 -3.010394 -2.408185
C  -3.448548 -3.438663 -1.12657
C  -4.095071 -1.623029 -2.631147
C  -4.125272 -4.015966 -3.519297
H  -0.754907 -0.256989 1.823389
H  1.965809 3.075999 -2.136617
H  -2.068757 1.950812 -0.936057
H  -0.545364 3.208196 -2.444399
H  2.838162 -1.153718 3.359266
H  5.337572 -1.269813 3.793213
H  -2.880952 -2.837218 0.904947
H  -4.037062 0.393971 -1.765968
H  6.901524 0.013969 2.304151
H  -3.305868 -4.507933 -0.933935
H  -4.456632 -1.280165 -3.607129
H  -3.199341 -4.175461 -4.105049
H  -4.433643 -4.997545 -3.120249
H  -4.902473 -3.670638 -4.222569
