program: Gaussian 09
title: 000066434
version: EM64L-G09RevD.01
frameworkgroup: C1[X(C18H22O2)]
method: RPBEPBE
basis: SDD
operation: Freq
keyword: #pfreq=noraman
keyword: PBEPBE/SDD
title: #p freq=noraman PBEPBE/SDD
converged: YES YES NO NO
title: Mulliken charges:
elementType: O O C C C C C C C C C C C C C C C C C C H H H H H H H H H H H H H H H H H H H H H H
charge: -0.450596 -0.437583 -0.105520 0.266447 -0.093914 -0.575360 -0.206939 -0.257455 -0.444028 -0.521494 -0.341556 -0.793715 -0.188147 0.267969 -0.575968 0.325711 -0.369804 -0.580767 -0.400334 0.294332 0.238470 0.234905 0.210760 0.226049 0.211677 0.226735 0.218236 0.241893 0.223006 0.218391 0.231817 0.234385 0.217126 0.233548 0.189316 0.223028 0.225130 0.339949 0.220284 0.223130 0.249354 0.351532
chargesum: 0.00000
title: Mulliken charges with hydrogens summed into heavy atoms:
elementType: O O C C C C C C C C C C C C C C C C C C
charge: -0.110647 -0.086051 0.132950 0.266447 0.140991 -0.138552 0.004738 -0.030720 0.016101 -0.080096 -0.109739 -0.108657 0.001169 0.267969 -0.127810 0.325711 -0.149520 -0.357637 -0.150980 0.294332
polarizability: 2.62013674e+02 -3.07971358e+00 1.87574700e+02 -5.69009251e-01 2.61152022e+00 1.27494741e+02
1716.lowfreq: -4.1477 -0.0007 -0.0005 0.0004 5.7542 10.5813 28.3897 57.8869 96.3731
frequency: 28.2714 57.8700 96.3713 108.5964 125.8931 162.7511 178.1441 184.2996 214.0938 237.2549 242.9953 259.2987 285.9065 299.8666 313.3737 343.9524 362.4156 365.0216 409.1605 420.6462 430.9813 437.8364 449.5578 486.4488 496.5861 527.3290 550.5990 558.3309 580.6166 627.9147 645.3339 697.8901 710.8336 722.1340 749.5196 772.7352 794.5423 805.9076 830.1869 843.4039 861.5405 879.4811 894.2522 909.0798 925.8280 932.3106 945.0465 953.6346 971.2796 989.3652 998.0141 1012.6605 1030.8213 1052.8436 1066.0787 1087.5329 1102.5442 1113.8167 1135.3945 1139.3850 1148.8923 1157.8357 1172.4765 1177.5551 1185.1500 1203.3191 1204.8435 1215.9460 1220.8756 1232.5966 1250.6238 1258.7971 1260.3505 1269.2084 1288.5976 1291.5716 1298.7635 1314.8442 1318.8713 1327.7457 1337.5569 1342.7924 1355.2046 1378.1131 1381.3554 1389.6753 1395.4766 1425.8527 1453.4190 1455.8901 1467.6842 1472.4828 1476.0758 1485.8009 1500.1947 1602.1334 1619.3519 1643.6609 2877.6407 2940.2511 2956.6869 2960.3718 2964.3673 2975.7831 2979.0891 2992.1156 3014.7175 3022.0165 3038.9675 3054.5661 3063.6575 3065.7898 3084.5906 3088.3804 3091.4269 3118.5959 3143.4438 3172.0030 3538.8924 3581.1687
redmass: 4.2831 4.1652 3.9558 3.5502 2.6455 1.3588 3.3777 2.6243 2.1263 3.7996 2.7698 2.4639 1.3877 3.0031 4.1965 1.1187 3.2538 2.7932 4.1519 3.7582 3.1540 2.8431 3.5080 3.3448 4.9647 3.2570 3.5391 3.7887 2.7323 3.6626 2.8835 3.0069 2.5182 3.7052 2.7749 3.2417 1.9985 1.6491 1.7002 2.1026 1.8436 2.1166 2.4391 3.8870 2.3596 1.7964 1.3949 1.7791 1.3183 2.5454 2.2869 2.4672 2.1860 2.1348 2.6130 2.4277 2.0740 1.7151 1.6658 1.6779 1.3193 1.4275 1.5416 1.7955 1.7241 1.7504 1.6648 1.2920 1.3731 1.3965 1.5102 1.9787 1.4101 1.6032 1.3821 1.6879 1.4107 1.4528 1.4225 1.4927 1.6051 1.4058 1.4391 1.8203 2.2104 1.6285 1.3447 3.3471 1.0759 1.1247 1.0639 1.0914 1.0617 1.0828 2.7123 6.5386 6.5961 7.9379 1.0784 1.0803 1.0637 1.0850 1.0744 1.0677 1.0416 1.0623 1.0942 1.0631 1.1013 1.1007 1.0903 1.0937 1.1007 1.1023 1.0906 1.0940 1.0873 1.0960 1.0653 1.0660
irintensity: 0.4614 0.9054 0.1727 1.3796 1.9548 0.2271 0.4585 0.2333 1.0838 6.2542 11.3173 7.2413 174.3972 19.0773 0.3998 142.2647 9.2946 11.5462 2.3727 4.6680 9.5381 9.8587 11.6205 1.3740 6.9862 1.3988 3.0874 1.4723 2.1122 0.1402 5.9656 5.3597 32.1228 5.9046 10.8965 0.5287 6.3382 38.6025 0.5220 12.1489 22.7360 2.0247 2.7324 28.5079 24.6924 7.5537 1.5446 19.2404 7.2097 3.5096 0.8064 29.7390 4.0102 0.6444 4.5634 0.6472 1.4445 2.0316 237.3855 40.5133 5.0361 3.4120 15.0048 11.9492 2.9340 19.5610 8.6205 1.2207 12.0086 6.2453 31.6546 13.8993 23.4516 1.7784 1.3172 12.6216 0.0643 5.1818 7.8484 3.9204 1.1267 5.3598 0.7903 9.0851 15.2316 3.5809 9.1036 46.8408 9.4084 9.6705 7.3155 6.1624 4.3907 9.0271 87.2671 7.2370 61.7823 5.1194 13.8128 4.0191 29.7528 54.2842 8.1542 31.1814 55.1223 32.8186 37.6737 53.0530 50.7203 26.3719 2.8738 39.3886 34.1168 35.9428 24.7947 28.0363 19.0158 12.0325 3.3080 36.9257
temp: 298.150 k
press: 1.00000 atm
elementType: 8 8 6 6 6 6 6 6 6 6 6 6 6 6 6 6 6 6 6 6 1 1 1 1 1 1 1 1 1 1 1 1 1 1 1 1 1 1 1 1 1 1
symmnumber: 1
zpe: 933816.3 jmol-1
zpe.correction: 0.355672 hartree
zpe.thermalcorrener: 0.373372 hartree
zpe.thermalcorrenthalpy: 0.374316 hartree
zpe.thermalcorrgfe: 0.311321 hartree
zpe.sumelectzpe: -848.054430 hartree
zpe.sumelectthermal: -848.036730 hartree
zpe.sumelectthermalent: -848.035785 hartree
zpe.sumelectthermalfe: -848.098781 hartree
dipole: 0.3094 1.5908 1.2982
dipole: 2.0765
quadrupole: -127.7413 -108.2771 -123.8363
quadrupole: 11.8885 -6.4553 1.5750
quadrupole: -7.7897 11.6745 -3.8848 11.8885 -6.4553 1.5750
hfenergy: -848.4101019 hartree
pointgroup: C01 [X(C18H22O2)]
dipole: 0.1300951 0.6090038 0.5287863 debye
polarizability: 261.9575974|-2.8436246|187.3281647|-3.070143|4.6253549|127.7973532 unknown
InChI: InChI=1S/C18H22O2/c1-18-9-8-14-13-5-3-12(19)10-11(13)2-4-15(14)16(18)6-7-17(18)20/h3,5,8-10,14-17,19-20H,2,4,6-7H2,1H3
charge 0 multiplicity 1
42 atoms
O  -4.26862 -1.027015 -1.307903
O  5.90924 -0.21501 0.193035
C  -2.060661 0.642935 -0.174441
C  -2.625337 -0.610608 0.564071
C  -0.557789 0.817114 0.086612
C  -3.099828 1.740246 0.146136
C  -4.111328 -0.562963 0.08516
C  0.168181 -0.396394 -0.577489
C  -4.46225 0.957732 0.091178
C  0.070583 2.11516 -0.456923
C  -1.803994 -1.829153 0.187673
C  -2.633714 -0.492346 2.118603
C  -0.526994 -1.723291 -0.274252
C  1.684009 -0.352011 -0.310639
C  1.541316 2.218422 0.004868
C  2.322167 0.904686 -0.089114
C  2.494907 -1.516197 -0.357567
C  3.72787 0.955341 0.08064
C  3.891601 -1.467733 -0.187023
C  4.509849 -0.218578 0.033286
H  -2.178424 0.419763 -1.258493
H  -0.36722 0.787358 1.1806
H  -3.076843 2.570476 -0.581105
H  -2.931047 2.17755 1.14891
H  -4.775351 -1.156499 0.748716
H  0.048919 -0.243734 -1.678537
H  -5.121189 1.216018 0.938573
H  -5.01375 1.173885 -0.83987
H  -0.490505 3.000282 -0.10205
H  0.01106 2.11636 -1.564557
H  -2.225421 -2.827409 0.386235
H  -3.26862 0.341217 2.469387
H  -3.030128 -1.424639 2.563559
H  -1.615682 -0.346293 2.518079
H  0.025403 -2.646391 -0.493231
H  1.557025 2.552857 1.063617
H  2.070504 3.003121 -0.570328
H  -3.809254 -1.901471 -1.40262
H  2.037697 -2.494776 -0.533312
H  4.210037 1.929403 0.249966
H  4.506511 -2.371517 -0.224514
H  6.242071 0.704602 0.341764
