program: Orca
programVersion: 5.0.2
elementType: Cl Cl S S P O O C C C C C C C C C C C H H H H H H H H H H H H H H H
charge: 0
multiplicity: 1
keywords: wb97x-d3
keywords: def2-TZVPP
keywords: def2/J RIJCOSX
keywords: DEFGRID2
keywords: scfconv7
keywords: smallprint printgap noloewdin
keywords: NOSOSCF
formula: C11H15Cl2O2PS2
InChI: InChI=1/C11H15Cl2O2PS2/c1-3-7-18-16(17,14-4-2)15-11-6-5-9(12)8-10(11)13/h5-6,8H,3-4,7H2,1-2H3
33 atoms
Cl -1.19373 2.761563 0.331115
Cl -5.172071 -0.827131 0.149008
S  2.106854 -1.580248 -1.024322
S  1.33887 0.382487 1.689276
P  1.616693 0.264463 -0.202024
O  0.334697 0.701149 -1.129782
O  2.719502 1.210959 -0.852044
C  2.698536 -2.548442 0.413316
C  1.779366 -3.714426 0.741763
C  0.422527 -3.302099 1.287208
C  -0.937639 0.329754 -0.812399
C  2.777417 2.608585 -0.504725
C  -1.768618 1.208805 -0.125905
C  -1.43265 -0.901447 -1.212331
C  3.936312 2.868416 0.426966
C  -3.075389 0.855538 0.168529
C  -2.735888 -1.265881 -0.922157
C  -3.547067 -0.385175 -0.225652
H  2.799479 -1.873808 1.264593
H  3.694419 -2.896782 0.140697
H  1.657858 -4.346429 -0.141516
H  2.300467 -4.33002 1.48114
H  0.522789 -2.714866 2.199309
H  -0.13168 -2.693726 0.572941
H  -0.183471 -4.178784 1.514654
H  2.895131 3.142728 -1.447454
H  1.838476 2.936782 -0.05376
H  -0.78833 -1.575556 -1.76038
H  3.793537 2.355975 1.377457
H  4.878429 2.539785 -0.010613
H  4.012954 3.937543 0.627125
H  -3.713463 1.544001 0.703693
H  -3.114756 -2.227681 -1.236803
totalener: -2636.99062368 hartree
nucrepener: 2156.26640229 hartree
electener: -4793.25702597 hartree
oneelecener: -7924.29197778 hartree
twoeener: 3131.03495181 hartree
kineticenergy: 2631.05592361 hartree
xcener: -154.160471126247 hartree
chargesum: 0.0000000
charge: -0.053359 -0.067623 -0.145053 -0.361998 0.603275 -0.341288 -0.313131 -0.105602 -0.094105 -0.228243 0.245960 0.026089 0.033044 -0.207460 -0.224315 -0.104878 -0.107452 0.057170 0.101625 0.118063 0.063143 0.067859 0.085732 0.051459 0.089433 0.095304 0.080577 0.145692 0.082676 0.086781 0.080477 0.115978 0.124169
qa: -0.0534 -0.0676 -0.1451 -0.3620 0.6033 -0.3413 -0.3131 -0.1056 -0.0941 -0.2282 0.2460 0.0261 0.0330 -0.2075 -0.2243 -0.1049 -0.1075 0.0572 0.1016 0.1181 0.0631 0.0679 0.0857 0.0515 0.0894 0.0953 0.0806 0.1457 0.0827 0.0868 0.0805 0.1160 0.1242
va: 1.2543 1.2349 2.3088 2.0740 5.4157 2.1083 2.1434 3.8575 3.8992 3.9446 3.8198 3.9091 3.9993 3.9987 3.9265 4.0237 4.0119 3.9501 1.0542 1.0109 1.0100 1.0095 1.0089 1.0126 1.0102 0.9962 1.0105 1.0082 1.0216 1.0054 1.0108 1.0196 1.0103
dispcorr: -0.018866953 hartree
energy: -2637.009490632840
dipole: 26.79582 -26.16525 0.63057 -12.73610 12.34770 -0.38841 4.50266 -4.75737 -0.25471
magnitude: 0.78317 au
magnitude: 1.99065 debye
