program: Orca
programVersion: 5.0.2
elementType: Cl Cl S S P O O C C C C C C C C C C C H H H H H H H H H H H H H H H
charge: 0
multiplicity: 1
keywords: wb97x-d3
keywords: def2-TZVPP
keywords: def2/J RIJCOSX
keywords: DEFGRID2
keywords: scfconv7
keywords: smallprint printgap noloewdin
keywords: NOSOSCF
formula: C11H15Cl2O2PS2
InChI: InChI=1/C11H15Cl2O2PS2/c1-3-7-18-16(17,14-4-2)15-11-6-5-9(12)8-10(11)13/h5-6,8H,3-4,7H2,1-2H3
33 atoms
Cl -1.212798 2.76362 0.315559
Cl -5.184698 -0.83259 0.134322
S  2.100406 -1.574638 -1.021957
S  1.322842 0.39131 1.686651
P  1.603745 0.270229 -0.2040
O  0.322544 0.701645 -1.134329
O  2.70501 1.219474 -0.852852
C  2.696553 -2.538317 0.416386
C  1.781702 -3.707503 0.745891
C  0.423271 -3.299788 1.290865
C  -0.949867 0.328753 -0.819004
C  2.768966 2.613965 -0.492981
C  -1.784126 1.208614 -0.137745
C  -1.441415 -0.904729 -1.216301
C  3.943975 2.862993 0.421032
C  -3.091137 0.853818 0.153925
C  -2.744793 -1.270649 -0.928741
C  -3.559487 -0.389009 -0.237465
H  2.793347 -1.861953 1.266762
H  3.694339 -2.882381 0.145357
H  1.662672 -4.340651 -0.136921
H  2.305181 -4.320432 1.485804
H  0.521301 -2.712892 2.203457
H  -0.132295 -2.692384 0.576732
H  -0.180412 -4.17836 1.517363
H  2.870588 3.157807 -1.432195
H  1.837978 2.93762 -0.02209
H  -0.794201 -1.579391 -1.760288
H  4.878195 2.537931 -0.03632
H  4.025722 3.929735 0.632091
H  3.81677 2.339931 1.368157
H  -3.732095 1.542897 0.684826
H  -3.120657 -2.234257 -1.241462
totalener: -2636.99065297 hartree
nucrepener: 2155.73072201 hartree
electener: -4792.72137498 hartree
oneelecener: -7923.22136895 hartree
twoeener: 3130.49999397 hartree
kineticenergy: 2631.05497371 hartree
xcener: -154.160200169233 hartree
chargesum: -0.0000000
charge: -0.053174 -0.067650 -0.145055 -0.362404 0.603005 -0.340616 -0.313162 -0.105332 -0.094123 -0.228040 0.245839 0.026748 0.032635 -0.207647 -0.223853 -0.104576 -0.107241 0.056941 0.101380 0.118029 0.063180 0.067795 0.085709 0.051375 0.089438 0.095413 0.079923 0.145656 0.086995 0.080503 0.082169 0.115959 0.124183
qa: -0.0532 -0.0676 -0.1451 -0.3624 0.6030 -0.3406 -0.3132 -0.1053 -0.0941 -0.2280 0.2458 0.0267 0.0326 -0.2076 -0.2239 -0.1046 -0.1072 0.0569 0.1014 0.1180 0.0632 0.0678 0.0857 0.0514 0.0894 0.0954 0.0799 0.1457 0.0870 0.0805 0.0822 0.1160 0.1242
va: 1.2546 1.2348 2.3088 2.0733 5.4164 2.1095 2.1429 3.8576 3.8994 3.9447 3.8205 3.9079 3.9994 3.9984 3.9276 4.0232 4.0123 3.9502 1.0543 1.0109 1.0100 1.0095 1.0089 1.0127 1.0102 0.9962 1.0108 1.0082 1.0053 1.0108 1.0214 1.0196 1.0103
dispcorr: -0.018846090 hartree
energy: -2637.009499060149
dipole: 26.94388 -26.30490 0.63898 -12.73694 12.34720 -0.38974 4.61459 -4.86248 -0.24789
magnitude: 0.78844 au
magnitude: 2.00406 debye
