program: Orca
programVersion: 5.0.2
elementType: Cl Cl S S P O O C C C C C C C C C C C H H H H H H H H H H H H H H H
charge: 0
multiplicity: 1
keywords: wb97x-d3
keywords: def2-TZVPP
keywords: def2/J RIJCOSX
keywords: DEFGRID2
keywords: scfconv7
keywords: smallprint printgap noloewdin
keywords: NOSOSCF
formula: C11H15Cl2O2PS2
InChI: InChI=1/C11H15Cl2O2PS2/c1-3-7-18-16(17,14-4-2)15-11-6-5-9(12)8-10(11)13/h5-6,8H,3-4,7H2,1-2H3
33 atoms
Cl -0.41508 1.221174 -2.34579
Cl -5.26042 -0.364032 -0.659081
S  1.342376 -1.476995 -0.764586
S  1.363068 -0.955654 2.606295
P  1.487196 -0.178635 0.865688
O  0.342248 0.916349 0.446405
O  2.788684 0.718571 0.691255
C  2.016962 -3.008928 -0.031908
C  3.52136 -3.005755 0.175761
C  4.323992 -2.814251 -1.100154
C  -0.957491 0.581138 0.213771
C  3.119777 1.42603 -0.514792
C  -1.458047 0.706301 -1.077407
C  -1.796506 0.162194 1.233824
C  2.799963 2.897585 -0.391575
C  -2.784714 0.422821 -1.351819
C  -3.123231 -0.132029 0.969386
C  -3.608001 -0.001187 -0.321831
H  1.720471 -3.784139 -0.741581
H  1.484461 -3.190254 0.901633
H  3.784811 -2.244357 0.913074
H  3.781619 -3.964656 0.633121
H  4.120785 -1.84639 -1.558826
H  5.393159 -2.8661 -0.897368
H  4.089919 -3.584105 -1.837329
H  4.189503 1.271467 -0.657071
H  2.610687 0.985152 -1.375647
H  -1.406217 0.06995 2.237946
H  3.293899 3.338312 0.47338
H  3.155465 3.41823 -1.281254
H  1.729376 3.071625 -0.308168
H  -3.164821 0.525691 -2.3579
H  -3.774675 -0.460371 1.766425
totalener: -2636.99243853 hartree
nucrepener: 2156.00759270 hartree
electener: -4793.00003123 hartree
oneelecener: -7923.45758391 hartree
twoeener: 3130.45755268 hartree
kineticenergy: 2631.05121448 hartree
xcener: -154.161274136953 hartree
chargesum: 0.0000000
charge: -0.060951 -0.066916 -0.172683 -0.356788 0.607088 -0.343075 -0.302316 -0.119728 -0.099086 -0.236921 0.203228 0.011147 0.022721 -0.150631 -0.225381 -0.095685 -0.114281 0.048569 0.115279 0.130913 0.068897 0.073855 0.070488 0.089545 0.075980 0.101949 0.082343 0.142449 0.091179 0.081598 0.083434 0.118487 0.125293
qa: -0.0610 -0.0669 -0.1727 -0.3568 0.6071 -0.3431 -0.3023 -0.1197 -0.0991 -0.2369 0.2032 0.0111 0.0227 -0.1506 -0.2254 -0.0957 -0.1143 0.0486 0.1153 0.1309 0.0689 0.0739 0.0705 0.0895 0.0760 0.1019 0.0823 0.1424 0.0912 0.0816 0.0834 0.1185 0.1253
va: 1.2519 1.2350 2.2974 2.1059 5.4081 2.1128 2.1308 3.8960 3.8701 3.9344 3.8572 3.8827 3.9726 4.0689 3.9333 4.0006 4.0341 3.9497 1.0048 1.0345 1.0287 1.0108 1.0137 1.0065 1.0046 0.9926 1.0093 1.0152 1.0067 1.0089 1.0206 1.0176 1.0098
dispcorr: -0.018645120 hartree
energy: -2637.011083650236
dipole: 34.20816 -33.65294 0.55522 -7.47563 7.33416 -0.14147 0.38624 -1.16059 -0.77435
magnitude: 0.96328 au
magnitude: 2.44845 debye
