program: Gaussian 09
title: 000066490
version: EM64L-G09RevD.01
frameworkgroup: C1[X(C28H18N2O6)]
method: RPBEPBE
basis: SDD
operation: Freq
keyword: #p
keyword: freq=noraman
keyword: PBEPBE/SDD
title: #p freq=noraman PBEPBE/SDD
converged: YES YES NO NO
title: Mulliken charges:
elementType: O O O O O O N N C C C C C C C C C C C C C C C C C C C C C C C C C C C C H H H H H H H H H H H H H H H H H H
charge: -0.260278 -0.260293 -0.442718 -0.442718 -0.264217 -0.264223 -0.493698 -0.493690 0.030423 0.030391 0.339847 0.339839 -0.160094 -0.160073 0.291413 0.291386 -0.437736 -0.437733 -0.392310 -0.392261 -0.228297 -0.228268 0.309290 0.309278 0.066487 0.066472 -0.376893 -0.376856 -0.299163 -0.299159 -0.222499 -0.222472 -0.249549 -0.249553 0.116298 0.116303 0.299762 0.299761 0.281414 0.281385 0.439799 0.439789 0.238120 0.238119 0.280603 0.280572 0.278465 0.278465 0.233316 0.233314 0.236733 0.236732 0.385488 0.385487
chargesum: 0.00000
title: Mulliken charges with hydrogens summed into heavy atoms:
elementType: O O O O O O N N C C C C C C C C C C C C C C C C C C C C C C C C C C C C
charge: -0.260278 -0.260293 -0.057230 -0.057231 -0.264217 -0.264223 -0.053899 -0.053902 0.030423 0.030391 0.339847 0.339839 -0.160094 -0.160073 0.291413 0.291386 -0.137974 -0.137971 -0.110896 -0.110876 0.009823 0.009851 0.309290 0.309278 0.066487 0.066472 -0.096290 -0.096284 -0.020698 -0.020694 0.010817 0.010842 -0.012816 -0.012820 0.116298 0.116303
polarizability: 8.03281973e+02 -2.95941195e+01 3.60244266e+02 -5.21168776e-03 -7.87888267e-05 2.05852696e+02
1716.lowfreq: -5.1371 -4.3436 -0.0009 -0.0006 0.0010 4.3442 12.1373 21.5676 30.4421
frequency: 12.0958 21.5667 30.4216 34.8067 49.0821 51.3507 70.5049 73.8511 74.9723 96.9856 122.9465 123.4765 126.0479 151.9960 169.3214 177.3344 181.7453 189.2016 220.3705 247.8135 260.1285 264.0871 280.7484 294.7252 314.2777 345.2106 347.4792 375.9428 400.1843 404.5034 416.9040 421.1667 422.6664 429.4909 447.2019 469.7198 483.7719 497.5422 507.9530 518.2625 519.9377 540.0068 549.5767 573.2379 581.0053 581.5184 581.7187 589.4002 600.1405 605.6686 645.7148 665.2817 678.2362 683.6891 688.5411 697.5164 713.8473 736.9183 737.0118 740.2064 745.1884 768.9902 777.0853 778.6578 779.8798 784.7975 785.0995 796.7593 823.4115 828.5931 831.2852 872.7747 876.8771 884.1772 890.3176 904.3794 939.8864 946.1560 964.1370 976.4255 976.4973 992.6822 992.9660 997.7431 999.3007 1003.5277 1003.6261 1035.8641 1047.8987 1048.1769 1073.5714 1096.7313 1112.3407 1113.4108 1163.4123 1164.2083 1165.8089 1179.0004 1179.7221 1187.5232 1196.2373 1199.0791 1239.2384 1240.4519 1277.3624 1281.1270 1304.9407 1308.5847 1319.9677 1320.1174 1334.3746 1340.4864 1368.9328 1378.5078 1392.7736 1399.5799 1406.6151 1426.7353 1436.2719 1437.9506 1444.6593 1445.7302 1471.2675 1475.2043 1491.2883 1504.5422 1540.1065 1544.7139 1569.7071 1577.8100 1581.7318 1586.3077 1598.2279 1603.5065 1606.0436 1616.2230 1636.4604 1636.5643 3135.6713 3135.6894 3141.0254 3141.1248 3157.2515 3157.2876 3166.6329 3166.6852 3171.3095 3171.3732 3173.3829 3174.7871 3177.1340 3177.6479 3183.7652 3183.7823 3531.4121 3531.4729
redmass: 7.1549 6.5277 7.2583 6.7661 7.3655 6.9577 8.9000 11.8231 6.9226 6.8350 5.7665 6.7942 5.1930 5.3801 6.3313 6.1814 5.6587 6.8879 4.4525 4.9143 5.8321 5.2942 7.2961 6.0723 5.7675 6.1631 6.8157 9.5840 9.0484 7.0835 7.2840 4.4958 3.2966 4.6970 6.6107 8.5543 4.0198 6.1097 4.7947 3.4176 4.6421 4.5808 4.0411 6.1944 5.9248 1.2396 1.2223 5.3998 5.1919 5.5019 5.0839 6.1515 4.1780 4.6629 4.7731 4.8674 3.0324 1.9334 4.0564 3.0289 1.8450 2.1576 1.9995 1.6853 2.8618 3.5023 5.1869 1.4413 1.8302 3.6171 4.8804 2.4888 5.2786 1.4172 1.9035 5.5871 1.3904 1.5209 4.9689 1.3730 1.3720 1.4336 1.3754 4.2333 4.8560 1.3332 1.3336 4.8299 2.2126 2.2810 2.2018 1.8097 1.8810 1.8634 1.9169 1.6637 1.9547 1.0920 1.0853 1.2418 1.8781 1.3964 1.8101 1.8924 2.2626 3.7429 1.8131 2.1958 2.7591 2.4922 2.6621 2.3479 5.4310 8.0603 10.0225 8.1105 3.6111 4.0222 2.6590 2.6246 3.3198 3.1927 2.9220 2.5698 4.0479 3.4201 3.3530 4.0702 6.7332 7.4702 3.3597 3.1538 4.9327 6.3616 6.4867 5.7076 5.3829 5.3338 1.0868 1.0868 1.0878 1.0878 1.0906 1.0905 1.0939 1.0940 1.0917 1.0929 1.0819 1.0806 1.0975 1.0974 1.0979 1.0979 1.0641 1.0641
irintensity: 0.4958 1.0089 1.2037 0.7578 1.0497 0.2145 0.7290 0.0152 1.4502 0.0009 0.0150 2.4362 0.0403 0.0004 4.8369 0.0002 0.5029 0.2500 0.9443 0.1973 3.1123 4.6115 3.3569 32.1318 3.6920 2.3339 0.4765 2.1902 0.5065 4.7229 31.9403 14.2107 11.1879 1.3677 0.4574 1.6260 2.5854 62.8912 1.1502 11.3436 0.1918 13.6147 0.9514 26.4517 7.7298 86.9202 111.5784 50.0377 34.7386 23.3006 1.5955 11.4428 22.7340 38.8635 14.9115 19.0507 43.1796 23.6486 19.3562 7.6269 46.6792 23.9369 131.0844 29.3008 34.1116 43.3589 0.0285 7.3128 92.9017 0.0725 2.0476 0.6348 42.0592 2.5291 4.7452 7.0154 1.3238 0.0463 4.0561 8.7687 1.2802 87.9048 4.4451 600.2279 133.7349 2.4196 0.3166 40.5650 1.2504 51.7894 0.0733 16.0336 286.3001 54.9731 279.9906 55.5752 38.8028 0.5361 5.8961 0.4550 0.0474 64.8185 2.5126 43.3205 600.8297 0.0053 0.2597 413.3562 229.4037 54.5590 791.3063 7.8168 55.4997 9.7770 32.0109 0.2266 135.7877 1.9455 80.2649 0.3855 0.0707 19.6141 6.5643 165.9123 2.1003 1354.1300 48.3221 133.4723 18.9911 299.1170 893.1316 6.2248 113.6645 0.1570 16.2164 0.0856 164.0875 91.6540 8.4614 7.2049 30.2523 0.0477 40.0432 2.4000 2.7431 6.2312 9.9435 10.9733 21.9502 169.6970 15.4349 0.1165 19.7930 5.8259 86.0500 43.7389
temp: 298.150 k
press: 1.00000 atm
elementType: 8 8 8 8 8 8 7 7 6 6 6 6 6 6 6 6 6 6 6 6 6 6 6 6 6 6 6 6 6 6 6 6 6 6 6 6 1 1 1 1 1 1 1 1 1 1 1 1 1 1 1 1 1 1
symmnumber: 1
zpe: 1038016.4 jmol-1
zpe.correction: 0.395360 hartree
zpe.thermalcorrener: 0.424179 hartree
zpe.thermalcorrenthalpy: 0.425123 hartree
zpe.thermalcorrgfe: 0.333849 hartree
zpe.sumelectzpe: -1636.259344 hartree
zpe.sumelectthermal: -1636.230525 hartree
zpe.sumelectthermalent: -1636.229580 hartree
zpe.sumelectthermalfe: -1636.320855 hartree
dipole: 0.0002 -0.0003 2.1280
dipole: 2.1280
quadrupole: -160.8962 -188.4189 -200.7688
quadrupole: -15.7980 0.0001 0.0002
quadrupole: 22.4651 -5.0576 -17.4075 -15.7980 0.0001 0.0002
hfenergy: -1636.6547038 hartree
pointgroup: C01 [X(C28H18N2O6)]
dipole: -0.0000659 -0.0002044 0.83722 debye
polarizability: 804.3087519|-20.4903853|359.2174673|0.0007723|0.0554026|205.8527164 unknown
InChI: InChI=1S/C28H18N2O6/c31-25-18-10-6-14-22(30-20-12-4-2-8-16(20)28(35)36)24(18)26(32)17-9-5-13-21(23(17)25)29-19-11-3-1-7-15(19)27(33)34/h1-14,29-30,33,35H
charge 0 multiplicity 1
54 atoms
O  -2.016659 -1.870811 -0.291283
O  2.01675 1.870686 -0.289804
O  -7.263653 -2.040821 -1.62913
O  7.263641 2.041524 -1.627999
O  -4.951729 -2.006796 -1.503888
O  4.95171 2.007282 -1.502912
N  -3.835476 0.020787 -0.020718
N  3.835509 -0.021023 -0.020727
C  -1.409228 0.457891 -0.12328
C  1.409293 -0.458124 -0.123576
C  -0.338934 1.409736 -0.145205
C  0.339004 -1.409956 -0.146179
C  -1.09446 -0.980033 -0.19168
C  1.094528 0.97984 -0.190995
C  -2.773219 0.931364 -0.041684
C  2.773288 -0.931633 -0.04229
C  -0.599899 2.794426 -0.128177
C  0.59998 -2.794655 -0.13013
C  -3.004795 2.342188 -0.056452
C  3.004874 -2.342446 -0.058061
C  -1.936684 3.25093 -0.100437
C  1.93677 -3.251166 -0.102702
C  -5.145058 0.253802 0.438874
C  5.14508 -0.254192 0.438825
C  -6.255562 -0.513073 -0.067409
C  6.255562 0.51299 -0.067041
C  -5.406661 1.206867 1.469073
C  5.406698 -1.207696 1.468618
C  -7.565247 -0.272151 0.433455
C  7.56524 0.271921 0.43377
C  -6.708118 1.422061 1.951075
C  6.708146 -1.423029 1.950581
C  -7.803982 0.691182 1.426513
C  7.803991 -0.691852 1.426397
C  -6.055331 -1.552593 -1.098871
C  6.055319 1.552969 -1.098038
H  0.248217 3.48358 -0.156733
H  -0.248129 -3.483797 -0.159187
H  -4.031824 2.71507 -0.079643
H  4.031901 -2.715311 -0.081554
H  -3.598392 -0.937604 -0.358049
H  3.598398 0.937532 -0.357581
H  -2.148675 4.325066 -0.128612
H  2.14877 -4.325279 -0.131653
H  -4.569186 1.743924 1.922116
H  4.569241 -1.744987 1.921416
H  -8.386079 -0.86495 0.021761
H  8.386052 0.864963 0.022387
H  -6.867173 2.150078 2.754435
H  6.867207 -2.151391 2.753627
H  -8.817675 0.861473 1.801604
H  8.817678 -0.862251 1.801457
H  -7.043933 -2.745972 -2.295222
H  7.043912 2.746966 -2.293782
