program: Orca
programVersion: 5.0.2
elementType: Cl Cl S S P O O C C C C C C C C C C C H H H H H H H H H H H H H H H
charge: 0
multiplicity: 1
keywords: wb97x-d3
keywords: def2-TZVPP
keywords: def2/J RIJCOSX
keywords: DEFGRID2
keywords: scfconv7
keywords: smallprint printgap noloewdin
keywords: NOSOSCF
formula: C11H15Cl2O2PS2
InChI: InChI=1/C11H15Cl2O2PS2/c1-3-7-18-16(17,14-4-2)15-11-6-5-9(12)8-10(11)13/h5-6,8H,3-4,7H2,1-2H3
33 atoms
Cl -1.595645 -0.844003 2.115379
Cl -5.131898 0.239147 -1.775479
S  1.079534 -1.397626 -0.231878
S  2.82461 0.899289 1.617397
P  1.45661 0.57462 0.325562
O  0.034701 1.205265 0.802783
O  1.581031 1.264015 -1.118079
C  1.768583 -2.329427 1.186368
C  3.222457 -2.719791 0.986727
C  3.456896 -3.649015 -0.193476
C  -1.144457 0.957554 0.164014
C  2.756543 1.059962 -1.917743
C  -2.025682 0.021997 0.695714
C  -1.505479 1.667422 -0.969956
C  3.711946 2.222658 -1.786747
C  -3.256414 -0.2023 0.101116
C  -2.732474 1.451771 -1.572195
C  -3.598805 0.514366 -1.03352
H  1.126453 -3.207364 1.275132
H  1.635733 -1.733173 2.0879
H  3.821863 -1.8132 0.888015
H  3.557337 -3.205225 1.908101
H  2.894629 -4.578524 -0.088937
H  3.158546 -3.185675 -1.134665
H  4.511155 -3.911368 -0.277939
H  3.2457 0.120486 -1.644087
H  2.401173 0.951483 -2.942598
H  -0.824881 2.403667 -1.373103
H  4.085115 2.313758 -0.768164
H  4.56447 2.067175 -2.448765
H  3.235836 3.161303 -2.067899
H  -3.935906 -0.929346 0.521963
H  -3.01172 2.011357 -2.453367
totalener: -2636.99116550 hartree
nucrepener: 2144.69122226 hartree
electener: -4781.68238776 hartree
oneelecener: -7900.92558297 hartree
twoeener: 3119.24319521 hartree
kineticenergy: 2631.05195003 hartree
xcener: -154.160355575725 hartree
chargesum: -0.0000000
charge: -0.050831 -0.066950 -0.161769 -0.348787 0.601643 -0.308714 -0.329847 -0.112567 -0.102990 -0.237142 0.154146 0.021961 0.030554 -0.098989 -0.219640 -0.108634 -0.126708 0.062556 0.118968 0.116298 0.065917 0.070506 0.075430 0.073322 0.087687 0.077543 0.097977 0.128791 0.087603 0.078941 0.083344 0.116897 0.123487
qa: -0.0508 -0.0670 -0.1618 -0.3488 0.6016 -0.3087 -0.3298 -0.1126 -0.1030 -0.2371 0.1541 0.0220 0.0306 -0.0990 -0.2196 -0.1086 -0.1267 0.0626 0.1190 0.1163 0.0659 0.0705 0.0754 0.0733 0.0877 0.0775 0.0980 0.1288 0.0876 0.0789 0.0833 0.1169 0.1235
va: 1.2624 1.2349 2.2868 2.1024 5.4252 2.1676 2.0987 3.8567 3.9154 3.9234 3.9110 3.9083 3.9690 3.9874 3.9299 4.0333 4.0125 3.9433 1.0079 1.0370 1.0346 1.0111 1.0040 1.0160 1.0066 1.0042 0.9937 1.0165 1.0254 1.0102 1.0057 1.0211 1.0102
dispcorr: -0.017984015 hartree
energy: -2637.009149513408
dipole: 36.33710 -35.92621 0.41089 -8.54136 8.07734 -0.46402 -8.80787 7.80966 -0.99822
magnitude: 1.17498 au
magnitude: 2.98657 debye
